Error lines from build-log.txt
... skipping 401 lines ...
++ sed 's/namespace:.*/namespace: task-stepaction-ns/' stepaction/tekton-catalog-publish/0.2/tekton-catalog-publish.yaml
stepaction.tekton.dev/tekton-catalog-publish configured
+ test_yaml_can_install 'task/ansible-builder/0.1/tests task/ansible-runner/0.1/tests task/ansible-runner/0.2/tests task/asciidoctor/0.1/tests task/bentoml/0.1/tests task/black/0.1/tests task/black/0.2/tests task/blue-green-deploy/0.1/tests task/blue-green-deploy/0.2/tests task/buildah/0.1/tests task/buildah/0.2/tests task/buildah/0.3/tests task/buildah/0.4/tests task/buildah/0.5/tests task/buildah/0.6/tests task/buildah/0.7/tests task/buildah/0.8/tests task/buildah/0.9/tests task/buildpacks-phases/0.1/tests task/buildpacks-phases/0.2/tests task/buildpacks/0.1/tests task/buildpacks/0.2/tests task/buildpacks/0.3/tests task/buildpacks/0.4/tests task/buildpacks/0.5/tests task/buildpacks/0.6/tests task/check-make/0.1/tests task/codecov/0.1/tests task/curl/0.1/tests task/docker-build/0.1/tests task/dockerslim-build/0.1/tests task/flake8/0.1/tests task/gcloud/0.3/tests task/generate-build-id/0.1/tests task/git-batch-merge/0.1/tests task/git-batch-merge/0.2/tests task/git-cli/0.1/tests task/git-cli/0.2/tests task/git-cli/0.3/tests task/git-cli/0.4/tests task/git-clone/0.1/tests task/git-clone/0.2/tests task/git-clone/0.3/tests task/git-clone/0.4/tests task/git-clone/0.5/tests task/git-clone/0.6/tests task/git-clone/0.7/tests task/git-clone/0.8/tests task/git-clone/0.9/tests task/git-version/0.1/tests task/gitea-set-status/0.1/tests task/github-add-comment/0.1/tests task/github-add-comment/0.2/tests task/github-add-comment/0.3/tests task/github-add-comment/0.4/tests task/github-add-comment/0.5/tests task/github-add-comment/0.6/tests task/github-add-comment/0.7/tests task/github-add-gist/0.1/tests task/github-add-gist/0.2/tests task/github-create-deployment-status/0.1/tests task/github-create-deployment/0.2/tests task/github-open-pr/0.1/tests task/github-open-pr/0.2/tests task/github-request-reviewers/0.1/tests task/github-set-status/0.4/tests task/gitlab-set-status/0.1/tests task/gitlab-set-status/0.2/tests task/gitleaks/0.1/tests task/golang-build/0.1/tests task/golang-build/0.2/tests task/golang-build/0.3/tests task/golang-fuzz/0.1/tests task/golang-test/0.1/tests task/golang-test/0.2/tests task/golangci-lint/0.1/tests task/golangci-lint/0.2/tests task/gradle/0.1/tests task/gradle/0.2/tests task/gradle/0.3/tests task/gradle/0.4/tests task/grype/0.1/tests task/hadolint/0.1/tests task/helm-render-manifests-from-repo/0.1/tests task/helm-upgrade-from-repo/0.1/tests task/helm-upgrade-from-repo/0.2/tests task/helm-upgrade-from-repo/0.3/tests task/helm-upgrade-from-source/0.1/tests task/helm-upgrade-from-source/0.2/tests task/helm-upgrade-from-source/0.3/tests task/helm-upgrade-from-source/0.4/tests task/hugo/0.1/tests task/jenkins/0.1/tests task/jib-gradle/0.1/tests task/jib-gradle/0.2/tests task/jib-gradle/0.3/tests task/jib-gradle/0.4/tests task/jib-maven/0.1/tests task/jib-maven/0.2/tests task/jib-maven/0.3/tests task/jib-maven/0.4/tests task/jib-maven/0.5/tests task/jq/0.1/tests task/kamel-run/0.1/tests task/kaniko/0.1/tests task/kaniko/0.2/tests task/kaniko/0.3/tests task/kaniko/0.4/tests task/kaniko/0.5/tests task/kaniko/0.6/tests task/kind/0.1/tests task/ko/0.1/tests task/kube-linter/0.1/tests task/kubeconfig-creator/0.1/tests task/kubernetes-actions/0.2/tests task/kythe-go/0.1/tests task/kythe-go/0.2/tests task/markdown-lint/0.1/tests task/maven/0.1/tests task/maven/0.2/tests task/maven/0.3/tests task/maven/0.4/tests task/mypy-lint/0.1/tests task/mypy-lint/0.2/tests task/npm/0.1/tests task/openshift-client/0.1/tests task/openshift-client/0.2/tests task/orka-deploy/0.1/tests task/orka-deploy/0.2/tests task/orka-full/0.1/tests task/orka-full/0.2/tests task/orka-init/0.1/tests task/orka-init/0.2/tests task/orka-teardown/0.1/tests task/orka-teardown/0.2/tests task/pluto/0.1/tests task/powershell/0.1/tests task/prettier/0.1/tests task/pull-request/0.1/tests task/pylint/0.1/tests task/pylint/0.2/tests task/pylint/0.3/tests task/pytest/0.1/tests task/pytest/0.2/tests task/python-coverage/0.1/tests task/redhat-codeready-dependency-analysis/0.1/tests task/redhat-dependency-analytics/0.1/tests task/redhat-dependency-analytics/0.2/tests task/replace-tokens/0.1/tests task/robot-framework/0.1/tests task/ruby-lint/0.1/tests task/s2i/0.1/tests task/s2i/0.2/tests task/s2i/0.3/tests task/shellcheck/0.1/tests task/shp/0.1/tests task/skopeo-copy/0.1/tests task/skopeo-copy/0.2/tests task/skopeo-copy/0.3/tests task/skopeo-copy/0.4/tests task/sonarqube-scanner/0.2/tests task/sonarqube-scanner/0.3/tests task/sonarqube-scanner/0.4/tests task/syft/0.1/tests task/tekton-catalog-publish/0.1/tests task/tkn/0.2/tests task/tkn/0.3/tests task/tkn/0.4/tests task/trigger-jenkins-job/0.1/tests task/trivy-scanner/0.1/tests task/trivy-scanner/0.2/tests task/ts-lint/0.1/tests task/upload-pypi/0.2/tests task/valint/0.1/tests task/wget/0.1/tests task/write-file/0.1/tests task/yaml-lint/0.1/tests task/yq/0.1/tests task/yq/0.2/tests task/yq/0.3/tests task/yq/0.4/tests'
+ ns=task-stepaction-ns
+ all_tasks='task/ansible-builder/0.1/tests task/ansible-runner/0.1/tests task/ansible-runner/0.2/tests task/asciidoctor/0.1/tests task/bentoml/0.1/tests task/black/0.1/tests task/black/0.2/tests task/blue-green-deploy/0.1/tests task/blue-green-deploy/0.2/tests task/buildah/0.1/tests task/buildah/0.2/tests task/buildah/0.3/tests task/buildah/0.4/tests task/buildah/0.5/tests task/buildah/0.6/tests task/buildah/0.7/tests task/buildah/0.8/tests task/buildah/0.9/tests task/buildpacks-phases/0.1/tests task/buildpacks-phases/0.2/tests task/buildpacks/0.1/tests task/buildpacks/0.2/tests task/buildpacks/0.3/tests task/buildpacks/0.4/tests task/buildpacks/0.5/tests task/buildpacks/0.6/tests task/check-make/0.1/tests task/codecov/0.1/tests task/curl/0.1/tests task/docker-build/0.1/tests task/dockerslim-build/0.1/tests task/flake8/0.1/tests task/gcloud/0.3/tests task/generate-build-id/0.1/tests task/git-batch-merge/0.1/tests task/git-batch-merge/0.2/tests task/git-cli/0.1/tests task/git-cli/0.2/tests task/git-cli/0.3/tests task/git-cli/0.4/tests task/git-clone/0.1/tests task/git-clone/0.2/tests task/git-clone/0.3/tests task/git-clone/0.4/tests task/git-clone/0.5/tests task/git-clone/0.6/tests task/git-clone/0.7/tests task/git-clone/0.8/tests task/git-clone/0.9/tests task/git-version/0.1/tests task/gitea-set-status/0.1/tests task/github-add-comment/0.1/tests task/github-add-comment/0.2/tests task/github-add-comment/0.3/tests task/github-add-comment/0.4/tests task/github-add-comment/0.5/tests task/github-add-comment/0.6/tests task/github-add-comment/0.7/tests task/github-add-gist/0.1/tests task/github-add-gist/0.2/tests task/github-create-deployment-status/0.1/tests task/github-create-deployment/0.2/tests task/github-open-pr/0.1/tests task/github-open-pr/0.2/tests task/github-request-reviewers/0.1/tests task/github-set-status/0.4/tests task/gitlab-set-status/0.1/tests task/gitlab-set-status/0.2/tests task/gitleaks/0.1/tests task/golang-build/0.1/tests task/golang-build/0.2/tests task/golang-build/0.3/tests task/golang-fuzz/0.1/tests task/golang-test/0.1/tests task/golang-test/0.2/tests task/golangci-lint/0.1/tests task/golangci-lint/0.2/tests task/gradle/0.1/tests task/gradle/0.2/tests task/gradle/0.3/tests task/gradle/0.4/tests task/grype/0.1/tests task/hadolint/0.1/tests task/helm-render-manifests-from-repo/0.1/tests task/helm-upgrade-from-repo/0.1/tests task/helm-upgrade-from-repo/0.2/tests task/helm-upgrade-from-repo/0.3/tests task/helm-upgrade-from-source/0.1/tests task/helm-upgrade-from-source/0.2/tests task/helm-upgrade-from-source/0.3/tests task/helm-upgrade-from-source/0.4/tests task/hugo/0.1/tests task/jenkins/0.1/tests task/jib-gradle/0.1/tests task/jib-gradle/0.2/tests task/jib-gradle/0.3/tests task/jib-gradle/0.4/tests task/jib-maven/0.1/tests task/jib-maven/0.2/tests task/jib-maven/0.3/tests task/jib-maven/0.4/tests task/jib-maven/0.5/tests task/jq/0.1/tests task/kamel-run/0.1/tests task/kaniko/0.1/tests task/kaniko/0.2/tests task/kaniko/0.3/tests task/kaniko/0.4/tests task/kaniko/0.5/tests task/kaniko/0.6/tests task/kind/0.1/tests task/ko/0.1/tests task/kube-linter/0.1/tests task/kubeconfig-creator/0.1/tests task/kubernetes-actions/0.2/tests task/kythe-go/0.1/tests task/kythe-go/0.2/tests task/markdown-lint/0.1/tests task/maven/0.1/tests task/maven/0.2/tests task/maven/0.3/tests task/maven/0.4/tests task/mypy-lint/0.1/tests task/mypy-lint/0.2/tests task/npm/0.1/tests task/openshift-client/0.1/tests task/openshift-client/0.2/tests task/orka-deploy/0.1/tests task/orka-deploy/0.2/tests task/orka-full/0.1/tests task/orka-full/0.2/tests task/orka-init/0.1/tests task/orka-init/0.2/tests task/orka-teardown/0.1/tests task/orka-teardown/0.2/tests task/pluto/0.1/tests task/powershell/0.1/tests task/prettier/0.1/tests task/pull-request/0.1/tests task/pylint/0.1/tests task/pylint/0.2/tests task/pylint/0.3/tests task/pytest/0.1/tests task/pytest/0.2/tests task/python-coverage/0.1/tests task/redhat-codeready-dependency-analysis/0.1/tests task/redhat-dependency-analytics/0.1/tests task/redhat-dependency-analytics/0.2/tests task/replace-tokens/0.1/tests task/robot-framework/0.1/tests task/ruby-lint/0.1/tests task/s2i/0.1/tests task/s2i/0.2/tests task/s2i/0.3/tests task/shellcheck/0.1/tests task/shp/0.1/tests task/skopeo-copy/0.1/tests task/skopeo-copy/0.2/tests task/skopeo-copy/0.3/tests task/skopeo-copy/0.4/tests task/sonarqube-scanner/0.2/tests task/sonarqube-scanner/0.3/tests task/sonarqube-scanner/0.4/tests task/syft/0.1/tests task/tekton-catalog-publish/0.1/tests task/tkn/0.2/tests task/tkn/0.3/tests task/tkn/0.4/tests task/trigger-jenkins-job/0.1/tests task/trivy-scanner/0.1/tests task/trivy-scanner/0.2/tests task/ts-lint/0.1/tests task/upload-pypi/0.2/tests task/valint/0.1/tests task/wget/0.1/tests task/write-file/0.1/tests task/yaml-lint/0.1/tests task/yq/0.1/tests task/yq/0.2/tests task/yq/0.3/tests task/yq/0.4/tests'
+ kubectl create ns task-stepaction-ns
Error from server (AlreadyExists): namespaces "task-stepaction-ns" already exists
+ true
+ local runtest
+ for runtest in ${all_tasks}
+ local runtestdir=ansible-builder/0.1/tests
+ local testname=ansible-builder
+ runtest=task/ansible-builder/0.1/
... skipping 9687 lines ...
pipelinerun.tekton.dev/jib-gradle-test-pipeline-run created
03h59:55::04h00:57 SUCCESS: helm-upgrade-from-source/0-4 testrun has successfully executed
03h59:54::04h01:09 SUCCESS: helm-upgrade-from-source/0-3 testrun has successfully executed
03h59:53::04h01:16 SUCCESS: helm-upgrade-from-source/0-2 testrun has successfully executed
03h59:56::04h01:27 SUCCESS: hugo/0-1 testrun has successfully executed
03h59:57::04h01:48 SUCCESS: jenkins/0-1 testrun has successfully executed
FAILED: jib-gradle/0-3 task has failed to comeback properly
NAME SHORTNAMES APIVERSION NAMESPACED KIND
bindings v1 true Binding
componentstatuses cs v1 false ComponentStatus
configmaps cm v1 true ConfigMap
endpoints ep v1 true Endpoints
events ev v1 true Event
... skipping 443 lines ...
claimName: jib-gradle-source-pvc
status:
completionTime: "2025-02-17T04:01:37Z"
conditions:
- lastTransitionTime: "2025-02-17T04:01:37Z"
message: '"step-build-and-push" exited with code 1'
reason: Failed
status: "False"
type: Succeeded
podName: jib-gradle-test-pipeline-run-jib-gradle-pod
provenance:
featureFlags:
AwaitSidecarReadiness: true
... skipping 33 lines ...
imageID: gcr.io/cloud-builders/gradle@sha256:96d6343589392afd9eab8c4463ec899b8b1c972e7cd70678a70a4821c16eb4c9
name: build-and-push
terminated:
containerID: containerd://064c399bbd9fe23ff85a45f23f8f25efc4b43a7fc6cec395bc8b89a87ef68c16
exitCode: 1
finishedAt: "2025-02-17T04:01:36Z"
reason: Error
startedAt: "2025-02-17T04:01:23Z"
terminationReason: Error
- container: step-digest-to-results
imageID: gcr.io/cloud-builders/gradle@sha256:96d6343589392afd9eab8c4463ec899b8b1c972e7cd70678a70a4821c16eb4c9
name: digest-to-results
terminated:
containerID: containerd://a5eb38cefbe407c49c30014a43c533f0bf7bf34205f878bf15fa3825a0f486e5
exitCode: 1
finishedAt: "2025-02-17T04:01:37Z"
reason: Error
startedAt: "2025-02-17T04:01:37Z"
terminationReason: Skipped
taskSpec:
description: |-
This Task builds Java/Kotlin/Groovy/Scala source into a container image using Google’s Jib tool.
Jib works with Gradle and Maven projects, and this template is for Gradle projects.
... skipping 497 lines ...
kind: TaskRun
name: jib-gradle-test-pipeline-run-jib-gradle
pipelineTaskName: jib-gradle
completionTime: "2025-02-17T04:01:37Z"
conditions:
- lastTransitionTime: "2025-02-17T04:01:37Z"
message: 'Tasks Completed: 2 (Failed: 1, Cancelled 0), Skipped: 1'
reason: Failed
status: "False"
type: Succeeded
pipelineSpec:
tasks:
- name: fetch-repository
params:
... skipping 175 lines ...
+ git log -1 '--pretty=%ct'
+ RESULT_COMMITTER_DATE=1580142889
+ printf '%s' 1580142889
+ printf '%s' bcbc20a83f930257aeae6da3faf074d0b5f094a4
+ printf '%s' https://github.com/che-samples/console-java-simple
----POD_NAME: pod/jib-gradle-test-pipeline-run-jib-gradle-pod---
2025/02/17 04:01:37 Skipping step because a previous step failed
2025/02/17 04:01:38 Exiting...
2025/02/17 04:00:56 Entrypoint initialization
2025/02/17 04:00:56 Decoded script /tekton/scripts/script-0-9z57c
2025/02/17 04:00:56 Decoded script /tekton/scripts/script-1-hb6c9
Welcome to Gradle 5.6.2!
... skipping 8 lines ...
Starting a Gradle Daemon (subsequent builds will be faster)
> Task :compileJava
> Task :processResources NO-SOURCE
> Task :classes
> Task :jib FAILED
Containerizing application to localhost:5000/tekton-pipelines/console-java-simple...
Base image 'eclipse-temurin:8-jre' does not use a specific image digest - build may not be reproducible
Building classes layer...
Getting manifest for base image eclipse-temurin:8-jre...
Building jvm arg files layer...
Cannot verify server at https://localhost:5000/v2/. Attempting again with no TLS verification.
Failed to connect to https://localhost:5000/v2/ over HTTPS. Attempting again with HTTP.
The base image requires auth. Trying again for eclipse-temurin:8-jre...
A new version of jib-gradle-plugin (3.4.4) is available (currently using 3.2.1). Update your build configuration to use the latest features and fixes!
https://github.com/GoogleContainerTools/jib/blob/master/jib-gradle-plugin/CHANGELOG.md
Please see https://github.com/GoogleContainerTools/jib/blob/master/docs/privacy.md for info on disabling this update check.
FAILURE: Build failed with an exception.
* What went wrong:
Execution failed for task ':jib'.
> com.google.cloud.tools.jib.plugins.common.BuildStepsExecutionException: Unknown mediaType: application/vnd.oci.image.index.v1+json
* Try:
Run with --info or --debug option to get more log output. Run with --scan to get full insights.
* Exception is:
org.gradle.api.tasks.TaskExecutionException: Execution failed for task ':jib'.
at org.gradle.api.internal.tasks.execution.ExecuteActionsTaskExecuter$3.accept(ExecuteActionsTaskExecuter.java:166)
at org.gradle.api.internal.tasks.execution.ExecuteActionsTaskExecuter$3.accept(ExecuteActionsTaskExecuter.java:163)
at org.gradle.internal.Try$Failure.ifSuccessfulOrElse(Try.java:191)
at org.gradle.api.internal.tasks.execution.ExecuteActionsTaskExecuter.execute(ExecuteActionsTaskExecuter.java:156)
at org.gradle.api.internal.tasks.execution.ValidatingTaskExecuter.execute(ValidatingTaskExecuter.java:62)
at org.gradle.api.internal.tasks.execution.SkipEmptySourceFilesTaskExecuter.execute(SkipEmptySourceFilesTaskExecuter.java:108)
... skipping 201 lines ...
at com.google.common.util.concurrent.InterruptibleTask.run(InterruptibleTask.java:74)
at com.google.common.util.concurrent.TrustedListenableFutureTask.run(TrustedListenableFutureTask.java:82)
* Get more help at https://help.gradle.org
BUILD FAILED in 12s
2 actionable tasks: 2 executed
+ EXIT_VALUE=1
+ set +o xtrace
Cleaning up after docker in docker.
================================================================================
Cleaning up binfmt_misc ...
... skipping 3 lines ...