ResultFAILURE
Tests 0 failed / 0 succeeded
Started2024-10-17 03:13
Elapsed18s
Revision23a69e135b7169c12e7198f1449bfe468950219e
Refs 2413

No Test Failures!


Error lines from build-log.txt

... skipping 69 lines ...
============================
🐱 running unit tests…
go: github.com/sigstore/sigstore in vendor/modules.txt requires go >= 1.22.8 (running go 1.22.7)
## Run unit tests
go test -timeout 5m  
go: github.com/sigstore/sigstore in vendor/modules.txt requires go >= 1.22.8 (running go 1.22.7)
make: *** [Makefile:127: test-unit] Error 1
===========================
==== UNIT TESTS FAILED ====
===========================
+ EXIT_VALUE=1
+ set +o xtrace