Error lines from build-log.txt
... skipping 542 lines ...
2025-03-17T10:06:12.411Z debug common/00_tektonconfigdeployment_test.go:253 resetting the tekton config to it's default state
2025-03-17T10:06:12.475Z debug common/00_tektonconfigdeployment_test.go:764 tektonConfig becomes ready
2025-03-17T10:06:12.694Z debug common/00_tektonconfigdeployment_test.go:697 pipeline cr is available
2025-03-17T10:06:12.694Z debug common/00_tektonconfigdeployment_test.go:255 test environment ready. starting the actual test
2025-03-17T10:06:12.694Z debug common/00_tektonconfigdeployment_test.go:677 changing profile {"newProfile": "lite"}
00_tektonconfigdeployment_test.go:684:
Error Trace: /home/prow/go/src/github.com/tektoncd/operator/test/e2e/common/00_tektonconfigdeployment_test.go:684
/home/prow/go/src/github.com/tektoncd/operator/test/e2e/common/00_tektonconfigdeployment_test.go:288
Error: Received unexpected error:
Operation cannot be fulfilled on tektonconfigs.operator.tekton.dev "config": the object has been modified; please apply your changes to the latest version and try again
Test: TestTektonConfigTestSuite/Test02_ChangeProfile
2025-03-17T10:06:12.745Z info common/00_tektonconfigdeployment_test.go:263 test failed, executing debug commands {"testName": "TestTektonConfigTestSuite/Test02_ChangeProfile"}
------------------- debug information -------------------
$ kubectl get tektonconfig
NAME VERSION READY REASON
config v0.73.2 True
... skipping 205 lines ...
=== RUN TestTektonConfigTestSuite/Test06_TestSCCConfig
2025-03-17T10:08:34.638Z debug common/00_tektonconfigdeployment_test.go:253 resetting the tekton config to it's default state
2025-03-17T10:08:39.697Z debug common/00_tektonconfigdeployment_test.go:764 tektonConfig becomes ready
2025-03-17T10:08:39.812Z debug common/00_tektonconfigdeployment_test.go:697 pipeline cr is available
2025-03-17T10:08:39.812Z debug common/00_tektonconfigdeployment_test.go:255 test environment ready. starting the actual test
00_tektonconfigdeployment_test.go:377: skipped: This test is only supported in OpenShift
--- FAIL: TestTektonConfigTestSuite (268.41s)
--- PASS: TestTektonConfigTestSuite/Test01_AutoInstall (120.82s)
--- FAIL: TestTektonConfigTestSuite/Test02_ChangeProfile (1.33s)
--- PASS: TestTektonConfigTestSuite/Test03_DeletePipeline (35.34s)
--- PASS: TestTektonConfigTestSuite/Test04_DeleteAndCreateConfig (105.35s)
--- SKIP: TestTektonConfigTestSuite/Test05_DisableAndEnableAddons (0.20s)
--- SKIP: TestTektonConfigTestSuite/Test06_TestSCCConfig (5.17s)
=== RUN TestTektonPipelinesDeployment
=== RUN TestTektonPipelinesDeployment/create-pipeline
... skipping 77 lines ...
2025-03-17T10:18:53.291Z debug common/05_tektonhubdeployment_test.go:172 deploying hub with external database
2025-03-17T10:18:53.378Z debug common/05_tektonhubdeployment_test.go:331 wait for external database deployment becomes ready {"namespace": "hub-external-db", "deploymentName": "tekton-hub-db"}
2025-03-17T10:19:28.386Z debug common/05_tektonhubdeployment_test.go:337 external database deployment is ready
=== RUN TestTektonHubTestSuite/Test04_DeployWithInvalidHubName
2025-03-17T10:19:38.469Z debug common/05_tektonhubdeployment_test.go:116 removing the tekton hub cr if any
2025-03-17T10:19:58.521Z debug common/05_tektonhubdeployment_test.go:121 test environment ready. starting the actual test
2025-03-17T10:20:03.544Z debug common/05_tektonhubdeployment_test.go:224 ready status {"condition": {"type":"Ready","status":"False","lastTransitionTime":"2025-03-17T10:19:58Z","reason":"Error","message":"Ready: Resource ignored, Expected Name: hub, Got Name: custom-hub-885sl"}}
--- PASS: TestTektonHubTestSuite (286.16s)
--- PASS: TestTektonHubTestSuite/Test01_DeployDefault (70.09s)
--- PASS: TestTektonHubTestSuite/Test02_DeployWithExternalDatabase (70.20s)
--- PASS: TestTektonHubTestSuite/Test03_DeployDefaultThenUpdateToExternalDatabase (120.27s)
--- PASS: TestTektonHubTestSuite/Test04_DeployWithInvalidHubName (25.08s)
=== RUN TestManualApprovalGateDeployment
... skipping 5 lines ...
--- PASS: TestManualApprovalGateDeployment (140.21s)
--- PASS: TestManualApprovalGateDeployment/create-pipeline (75.01s)
--- PASS: TestManualApprovalGateDeployment/create-manual-approval-gate (10.01s)
--- PASS: TestManualApprovalGateDeployment/restore-manual-approval-gate-deployments (5.04s)
--- PASS: TestManualApprovalGateDeployment/delete-manual-approval-gate (5.02s)
--- PASS: TestManualApprovalGateDeployment/delete-pipeline (5.04s)
FAIL
FAIL github.com/tektoncd/operator/test/e2e/common 1092.548s
FAIL
Finished run, return code is 1
mktemp: failed to create file via template '/workspace/source/artifacts/junit_XXXXXXXX': No such file or directory
XML report written to .xml
Running tests with 'go test -race -v -count=1 -tags=e2e -timeout=20m ./test/e2e/kubernetes --kubeconfig /root/.kube/config '
=== RUN TestTektonDashboardsDeployment
=== RUN TestTektonDashboardsDeployment/create-pipeline
=== RUN TestTektonDashboardsDeployment/create-dashboard
=== RUN TestTektonDashboardsDeployment/restore-dashboard-deployments
... skipping 10 lines ...
=== RUN TestTektonResultDeployment
tektonresultdeployment_test.go:40:
--- SKIP: TestTektonResultDeployment (0.00s)
PASS
ok github.com/tektoncd/operator/test/e2e/kubernetes 96.368s
Finished run, return code is 0
mktemp: failed to create file via template '/workspace/source/artifacts/junit_XXXXXXXX': No such file or directory
XML report written to .xml
***************************************
*** E2E TEST FAILED ***
*** Start of information dump ***
***************************************
>>> All resources:
NAMESPACE NAME READY STATUS RESTARTS AGE
kube-system pod/coredns-5dd5756b68-8qtf8 1/1 Running 0 29m
kube-system pod/coredns-5dd5756b68-nlcxn 1/1 Running 0 29m
... skipping 49 lines ...
kube-system kube-dns ClusterIP 10.96.0.10 <none> 53/UDP,53/TCP,9153/TCP 29m
metallb-system webhook-service ClusterIP 10.96.90.207 <none> 443/TCP 28m
tekton-operator tekton-operator ClusterIP 10.96.155.222 <none> 9090/TCP 24m
tekton-operator tekton-operator-webhook ClusterIP 10.96.171.165 <none> 443/TCP 24m
>>> Events:
NAMESPACE LAST SEEN TYPE REASON OBJECT MESSAGE
default 23m Warning UpdateFailed clusterinterceptor/bitbucket Failed to update status for "bitbucket": Internal error occurred: failed calling webhook "webhook.triggers.tekton.dev": failed to call webhook: Post "https://tekton-triggers-webhook.tekton-pipelines.svc:443/defaulting?timeout=10s": dial tcp 10.96.222.174:443: connect: connection refused
default 12m Warning UpdateFailed clusterinterceptor/bitbucket Failed to update status for "bitbucket": Internal error occurred: failed calling webhook "webhook.triggers.tekton.dev": failed to call webhook: Post "https://tekton-triggers-webhook.tekton-pipelines.svc:443/defaulting?timeout=10s": dial tcp 10.96.178.22:443: connect: connection refused
default 23m Warning UpdateFailed clusterinterceptor/cel Failed to update status for "cel": Internal error occurred: failed calling webhook "webhook.triggers.tekton.dev": failed to call webhook: Post "https://tekton-triggers-webhook.tekton-pipelines.svc:443/defaulting?timeout=10s": dial tcp 10.96.222.174:443: connect: connection refused
default 12m Warning UpdateFailed clusterinterceptor/cel Failed to update status for "cel": Internal error occurred: failed calling webhook "webhook.triggers.tekton.dev": failed to call webhook: Post "https://tekton-triggers-webhook.tekton-pipelines.svc:443/defaulting?timeout=10s": dial tcp 10.96.178.22:443: connect: connection refused
default 9m23s Warning UpdateFailed clusterinterceptor/cel Failed to update status for "cel": Internal error occurred: failed calling webhook "webhook.triggers.tekton.dev": failed to call webhook: Post "https://tekton-triggers-webhook.tekton-pipelines.svc:443/defaulting?timeout=10s": dial tcp 10.96.229.194:443: connect: connection refused
default 15m Normal FinalizerUpdate tektoninstallerset/chain-9xnqs Updated "chain-9xnqs" finalizers
default 15m Warning InternalError tektoninstallerset/chain-9xnqs configmaps "chains-info" already exists
default 11m Normal FinalizerUpdate tektoninstallerset/chain-config-24dv7 Updated "chain-config-24dv7" finalizers
default 23m Normal FinalizerUpdate tektoninstallerset/chain-config-dhkdk Updated "chain-config-dhkdk" finalizers
default 19m Normal FinalizerUpdate tektoninstallerset/chain-config-dhkdk Updated "chain-config-dhkdk" finalizers
default 17m Normal FinalizerUpdate tektoninstallerset/chain-config-fkfxj Updated "chain-config-fkfxj" finalizers
default 15m Normal FinalizerUpdate tektoninstallerset/chain-config-fn57r Updated "chain-config-fn57r" finalizers
default 9m14s Normal FinalizerUpdate tektoninstallerset/chain-config-pblcm Updated "chain-config-pblcm" finalizers
default 4m Normal FinalizerUpdate tektoninstallerset/chain-config-pblcm Updated "chain-config-pblcm" finalizers
default 10m Normal FinalizerUpdate tektoninstallerset/chain-qb784 Updated "chain-qb784" finalizers
default 11m Warning InternalError tektoninstallerset/chain-qb784 configmaps "tekton-chains-config-observability" already exists
default 10m Warning FinalizerUpdateFailed tektoninstallerset/chain-qb784 Failed to update finalizers for "chain-qb784": tektoninstallersets.operator.tekton.dev "chain-qb784" not found
default 9m13s Normal FinalizerUpdate tektoninstallerset/chain-secret-h6drt Updated "chain-secret-h6drt" finalizers
default 4m Normal FinalizerUpdate tektoninstallerset/chain-secret-h6drt Updated "chain-secret-h6drt" finalizers
default 11m Normal FinalizerUpdate tektoninstallerset/chain-secret-jzwt6 Updated "chain-secret-jzwt6" finalizers
default 23m Normal FinalizerUpdate tektoninstallerset/chain-secret-rcrls Updated "chain-secret-rcrls" finalizers
default 19m Normal FinalizerUpdate tektoninstallerset/chain-secret-rcrls Updated "chain-secret-rcrls" finalizers
default 15m Normal FinalizerUpdate tektoninstallerset/chain-secret-tgwzg Updated "chain-secret-tgwzg" finalizers
... skipping 12 lines ...
default 17m Normal FinalizerUpdate tektonchain/chain Updated "chain" finalizers
default 18m Warning InternalError tektonchain/chain reconcile again and proceed
default 15m Normal FinalizerUpdate tektonchain/chain Updated "chain" finalizers
default 15m Warning InternalError tektonchain/chain reconcile again and proceed
default 11m Normal FinalizerUpdate tektonchain/chain Updated "chain" finalizers
default 11m Warning InternalError tektonchain/chain reconcile again and proceed
default 11m Warning FinalizerUpdateFailed tektonchain/chain Failed to update finalizers for "chain": tektonchains.operator.tekton.dev "chain" not found
default 9m14s Normal FinalizerUpdate tektonchain/chain Updated "chain" finalizers
default 9m13s Warning InternalError tektonchain/chain reconcile again and proceed
default 4m6s Normal FinalizerUpdate tektonchain/chain Updated "chain" finalizers
default 24m Normal FinalizerUpdate tektonconfig/config Updated "config" finalizers
default 23m Warning InternalError tektonconfig/config reconcile again and proceed
default 19m Warning InternalError tektonconfig/config reconcile again and proceed
default 19m Normal FinalizerUpdate tektonconfig/config Updated "config" finalizers
default 19m Warning FinalizerUpdateFailed tektonconfig/config Failed to update finalizers for "config": tektonconfigs.operator.tekton.dev "config" not found
default 17m Normal FinalizerUpdate tektonconfig/config Updated "config" finalizers
default 17m Warning InternalError tektonconfig/config reconcile again and proceed
default 18m Warning InternalError tektonconfig/config Operation cannot be fulfilled on tektonconfigs.operator.tekton.dev "config": the object has been modified; please apply your changes to the latest version and try again
default 15m Normal FinalizerUpdate tektonconfig/config Updated "config" finalizers
default 15m Warning InternalError tektonconfig/config reconcile again and proceed
default 15m Warning FinalizerUpdateFailed tektonconfig/config Failed to update finalizers for "config": tektonconfigs.operator.tekton.dev "config" not found
default 9m54s Normal FinalizerUpdate tektonconfig/config Updated "config" finalizers
default 9m6s Warning InternalError tektonconfig/config reconcile again and proceed
default 4m6s Warning InternalError tektonconfig/config reconcile again and proceed
default 4m6s Normal FinalizerUpdate tektonconfig/config Updated "config" finalizers
default 4m6s Warning FinalizerUpdateFailed tektonconfig/config Failed to update finalizers for "config": tektonconfigs.operator.tekton.dev "config" not found
default 4m7s Normal FinalizerUpdate tektonhub/custom-hub-885sl Updated "custom-hub-885sl" finalizers
default 23m Normal FinalizerUpdate tektoninstallerset/dashboard-main-deployment-5cg9k Updated "dashboard-main-deployment-5cg9k" finalizers
default 19m Normal FinalizerUpdate tektoninstallerset/dashboard-main-deployment-5cg9k Updated "dashboard-main-deployment-5cg9k" finalizers
default 57s Normal FinalizerUpdate tektoninstallerset/dashboard-main-deployment-kdw64 Updated "dashboard-main-deployment-kdw64" finalizers
default 15m Normal FinalizerUpdate tektoninstallerset/dashboard-main-deployment-qr76c Updated "dashboard-main-deployment-qr76c" finalizers
default 17m Normal FinalizerUpdate tektoninstallerset/dashboard-main-deployment-thbgp Updated "dashboard-main-deployment-thbgp" finalizers
default 9m8s Normal FinalizerUpdate tektoninstallerset/dashboard-main-deployment-v2vjl Updated "dashboard-main-deployment-v2vjl" finalizers
default 4m7s Normal FinalizerUpdate tektoninstallerset/dashboard-main-deployment-v2vjl Updated "dashboard-main-deployment-v2vjl" finalizers
default 4m7s Warning FinalizerUpdateFailed tektoninstallerset/dashboard-main-deployment-v2vjl Failed to update finalizers for "dashboard-main-deployment-v2vjl": Operation cannot be fulfilled on tektoninstallersets.operator.tekton.dev "dashboard-main-deployment-v2vjl": the object has been modified; please apply your changes to the latest version and try again
default 9m11s Normal FinalizerUpdate tektoninstallerset/dashboard-main-static-b6vht Updated "dashboard-main-static-b6vht" finalizers
default 9m10s Warning InternalError tektoninstallerset/dashboard-main-static-b6vht rolebindings.rbac.authorization.k8s.io "tekton-dashboard-info" already exists
default 4m7s Normal FinalizerUpdate tektoninstallerset/dashboard-main-static-b6vht Updated "dashboard-main-static-b6vht" finalizers
default 15m Normal FinalizerUpdate tektoninstallerset/dashboard-main-static-f58zj Updated "dashboard-main-static-f58zj" finalizers
default 15m Warning InternalError tektoninstallerset/dashboard-main-static-f58zj rolebindings.rbac.authorization.k8s.io "tekton-dashboard-info" already exists
default 15m Warning FinalizerUpdateFailed tektoninstallerset/dashboard-main-static-f58zj Failed to update finalizers for "dashboard-main-static-f58zj": Operation cannot be fulfilled on tektoninstallersets.operator.tekton.dev "dashboard-main-static-f58zj": the object has been modified; please apply your changes to the latest version and try again
default 23m Normal FinalizerUpdate tektoninstallerset/dashboard-main-static-jf8l8 Updated "dashboard-main-static-jf8l8" finalizers
default 23m Warning InternalError tektoninstallerset/dashboard-main-static-jf8l8 rolebindings.rbac.authorization.k8s.io "tekton-dashboard-info" already exists
default 19m Warning InternalError tektoninstallerset/dashboard-main-static-jf8l8 clusterroles.rbac.authorization.k8s.io "tekton-dashboard-backend" not found
default 19m Normal FinalizerUpdate tektoninstallerset/dashboard-main-static-jf8l8 Updated "dashboard-main-static-jf8l8" finalizers
default 19m Warning FinalizerUpdateFailed tektoninstallerset/dashboard-main-static-jf8l8 Failed to update finalizers for "dashboard-main-static-jf8l8": tektoninstallersets.operator.tekton.dev "dashboard-main-static-jf8l8" not found
default 17m Normal FinalizerUpdate tektoninstallerset/dashboard-main-static-nr9kv Updated "dashboard-main-static-nr9kv" finalizers
default 18m Warning InternalError tektoninstallerset/dashboard-main-static-nr9kv clusterrolebindings.rbac.authorization.k8s.io "tekton-dashboard-tenant" already exists
default 17m Warning FinalizerUpdateFailed tektoninstallerset/dashboard-main-static-nr9kv Failed to update finalizers for "dashboard-main-static-nr9kv": tektoninstallersets.operator.tekton.dev "dashboard-main-static-nr9kv" not found
default 57s Normal FinalizerUpdate tektoninstallerset/dashboard-main-static-rgb2p Updated "dashboard-main-static-rgb2p" finalizers
default 72s Warning InternalError tektoninstallerset/dashboard-main-static-rgb2p configmaps "dashboard-info" already exists
default 56s Warning FinalizerUpdateFailed tektoninstallerset/dashboard-main-static-rgb2p Failed to update finalizers for "dashboard-main-static-rgb2p": Operation cannot be fulfilled on tektoninstallersets.operator.tekton.dev "dashboard-main-static-rgb2p": the object has been modified; please apply your changes to the latest version and try again
default 23m Normal FinalizerUpdate tektondashboard/dashboard Updated "dashboard" finalizers
default 19m Normal FinalizerUpdate tektondashboard/dashboard Updated "dashboard" finalizers
default 17m Normal FinalizerUpdate tektondashboard/dashboard Updated "dashboard" finalizers
default 17m Warning FinalizerUpdateFailed tektondashboard/dashboard Failed to update finalizers for "dashboard": tektondashboards.operator.tekton.dev "dashboard" not found
default 15m Normal FinalizerUpdate tektondashboard/dashboard Updated "dashboard" finalizers
default 9m11s Normal FinalizerUpdate tektondashboard/dashboard Updated "dashboard" finalizers
default 4m7s Normal FinalizerUpdate tektondashboard/dashboard Updated "dashboard" finalizers
default 57s Normal FinalizerUpdate tektondashboard/dashboard Updated "dashboard" finalizers
default 23m Warning UpdateFailed clusterinterceptor/github Failed to update status for "github": Internal error occurred: failed calling webhook "webhook.triggers.tekton.dev": failed to call webhook: Post "https://tekton-triggers-webhook.tekton-pipelines.svc:443/defaulting?timeout=10s": dial tcp 10.96.222.174:443: connect: connection refused
default 12m Warning UpdateFailed clusterinterceptor/github Failed to update status for "github": Internal error occurred: failed calling webhook "webhook.triggers.tekton.dev": failed to call webhook: Post "https://tekton-triggers-webhook.tekton-pipelines.svc:443/defaulting?timeout=10s": dial tcp 10.96.178.22:443: connect: connection refused
default 9m23s Warning UpdateFailed clusterinterceptor/github Failed to update status for "github": Internal error occurred: failed calling webhook "webhook.triggers.tekton.dev": failed to call webhook: Post "https://tekton-triggers-webhook.tekton-pipelines.svc:443/defaulting?timeout=10s": dial tcp 10.96.229.194:443: connect: connection refused
default 23m Warning UpdateFailed clusterinterceptor/gitlab Failed to update status for "gitlab": Internal error occurred: failed calling webhook "webhook.triggers.tekton.dev": failed to call webhook: Post "https://tekton-triggers-webhook.tekton-pipelines.svc:443/defaulting?timeout=10s": dial tcp 10.96.222.174:443: connect: connection refused
default 12m Warning UpdateFailed clusterinterceptor/gitlab Failed to update status for "gitlab": Internal error occurred: failed calling webhook "webhook.triggers.tekton.dev": failed to call webhook: Post "https://tekton-triggers-webhook.tekton-pipelines.svc:443/defaulting?timeout=10s": dial tcp 10.96.178.22:443: connect: connection refused
default 9m23s Warning UpdateFailed clusterinterceptor/gitlab Failed to update status for "gitlab": Internal error occurred: failed calling webhook "webhook.triggers.tekton.dev": failed to call webhook: Post "https://tekton-triggers-webhook.tekton-pipelines.svc:443/defaulting?timeout=10s": dial tcp 10.96.229.194:443: connect: connection refused
default 7m42s Normal FinalizerUpdate tektonhub/hub Updated "hub" finalizers
default 6m32s Normal FinalizerUpdate tektonhub/hub Updated "hub" finalizers
default 4m32s Normal FinalizerUpdate tektonhub/hub Updated "hub" finalizers
default 29m Normal Starting node/kind-control-plane Starting kubelet.
default 29m Warning InvalidDiskCapacity node/kind-control-plane invalid capacity 0 on image filesystem
default 29m Normal NodeAllocatableEnforced node/kind-control-plane Updated Node Allocatable limit across pods
... skipping 22 lines ...
default 28m Normal Starting node/kind-worker3
default 28m Normal NodeReady node/kind-worker3 Node kind-worker3 status is now: NodeReady
default 2m32s Normal FinalizerUpdate manualapprovalgate/manual-approval-gate Updated "manual-approval-gate" finalizers
default 2m32s Normal FinalizerUpdate tektoninstallerset/manualapprovalgate-main-deployment-5xjlx Updated "manualapprovalgate-main-deployment-5xjlx" finalizers
default 2m31s Normal FinalizerUpdate tektoninstallerset/manualapprovalgate-main-static-6vp9l Updated "manualapprovalgate-main-static-6vp9l" finalizers
default 2m46s Warning InternalError tektoninstallerset/manualapprovalgate-main-static-6vp9l clusterrolebindings.rbac.authorization.k8s.io "manual-approval-gate-webhook-leaderelection" already exists
default 2m31s Warning FinalizerUpdateFailed tektoninstallerset/manualapprovalgate-main-static-6vp9l Failed to update finalizers for "manualapprovalgate-main-static-6vp9l": Operation cannot be fulfilled on tektoninstallersets.operator.tekton.dev "manualapprovalgate-main-static-6vp9l": the object has been modified; please apply your changes to the latest version and try again
default 2m30s Warning FinalizerUpdateFailed tektoninstallerset/manualapprovalgate-main-static-6vp9l Failed to update finalizers for "manualapprovalgate-main-static-6vp9l": tektoninstallersets.operator.tekton.dev "manualapprovalgate-main-static-6vp9l" not found
default 9m47s Normal FinalizerUpdate tektoninstallerset/pipeline-main-deployment-2w9hh Updated "pipeline-main-deployment-2w9hh" finalizers
default 4m4s Normal FinalizerUpdate tektoninstallerset/pipeline-main-deployment-2w9hh Updated "pipeline-main-deployment-2w9hh" finalizers
default 10m Normal FinalizerUpdate tektoninstallerset/pipeline-main-deployment-8wggj Updated "pipeline-main-deployment-8wggj" finalizers
default 10m Warning FinalizerUpdateFailed tektoninstallerset/pipeline-main-deployment-8wggj Failed to update finalizers for "pipeline-main-deployment-8wggj": Operation cannot be fulfilled on tektoninstallersets.operator.tekton.dev "pipeline-main-deployment-8wggj": the object has been modified; please apply your changes to the latest version and try again
default 24m Normal FinalizerUpdate tektoninstallerset/pipeline-main-deployment-94pkx Updated "pipeline-main-deployment-94pkx" finalizers
default 19m Normal FinalizerUpdate tektoninstallerset/pipeline-main-deployment-94pkx Updated "pipeline-main-deployment-94pkx" finalizers
default 15m Normal FinalizerUpdate tektoninstallerset/pipeline-main-deployment-9qtgp Updated "pipeline-main-deployment-9qtgp" finalizers
default 51s Normal FinalizerUpdate tektoninstallerset/pipeline-main-deployment-glczb Updated "pipeline-main-deployment-glczb" finalizers
default 17m Normal FinalizerUpdate tektoninstallerset/pipeline-main-deployment-gs5v7 Updated "pipeline-main-deployment-gs5v7" finalizers
default 12m Normal FinalizerUpdate tektoninstallerset/pipeline-main-deployment-kkrvq Updated "pipeline-main-deployment-kkrvq" finalizers
default 12m Warning FinalizerUpdateFailed tektoninstallerset/pipeline-main-deployment-kkrvq Failed to update finalizers for "pipeline-main-deployment-kkrvq": Operation cannot be fulfilled on tektoninstallersets.operator.tekton.dev "pipeline-main-deployment-kkrvq": the object has been modified; please apply your changes to the latest version and try again
default 13m Normal FinalizerUpdate tektoninstallerset/pipeline-main-deployment-m2grj Updated "pipeline-main-deployment-m2grj" finalizers
default 13m Warning FinalizerUpdateFailed tektoninstallerset/pipeline-main-deployment-m2grj Failed to update finalizers for "pipeline-main-deployment-m2grj": Operation cannot be fulfilled on tektoninstallersets.operator.tekton.dev "pipeline-main-deployment-m2grj": the object has been modified; please apply your changes to the latest version and try again
default 17m Normal FinalizerUpdate tektoninstallerset/pipeline-main-deployment-qn8hb Updated "pipeline-main-deployment-qn8hb" finalizers
default 17m Warning FinalizerUpdateFailed tektoninstallerset/pipeline-main-deployment-qn8hb Failed to update finalizers for "pipeline-main-deployment-qn8hb": Operation cannot be fulfilled on tektoninstallersets.operator.tekton.dev "pipeline-main-deployment-qn8hb": the object has been modified; please apply your changes to the latest version and try again
default 2m26s Normal FinalizerUpdate tektoninstallerset/pipeline-main-deployment-tjmzl Updated "pipeline-main-deployment-tjmzl" finalizers
default 2m25s Warning FinalizerUpdateFailed tektoninstallerset/pipeline-main-deployment-tjmzl Failed to update finalizers for "pipeline-main-deployment-tjmzl": Operation cannot be fulfilled on tektoninstallersets.operator.tekton.dev "pipeline-main-deployment-tjmzl": the object has been modified; please apply your changes to the latest version and try again
default 10m Normal FinalizerUpdate tektoninstallerset/pipeline-main-static-4zqg9 Updated "pipeline-main-static-4zqg9" finalizers
default 11m Warning InternalError tektoninstallerset/pipeline-main-static-4zqg9 Operation cannot be fulfilled on configmaps "config-observability": the object has been modified; please apply your changes to the latest version and try again
default 11m Warning InternalError tektoninstallerset/pipeline-main-static-4zqg9 Internal error occurred: failed calling webhook "config.webhook.pipeline.tekton.dev": failed to call webhook: Post "https://tekton-pipelines-webhook.tekton-pipelines.svc:443/config-validation?timeout=10s": dial tcp 10.96.250.234:443: connect: connection refused
default 10m Warning FinalizerUpdateFailed tektoninstallerset/pipeline-main-static-4zqg9 Failed to update finalizers for "pipeline-main-static-4zqg9": Operation cannot be fulfilled on tektoninstallersets.operator.tekton.dev "pipeline-main-static-4zqg9": the object has been modified; please apply your changes to the latest version and try again
default 15m Normal FinalizerUpdate tektoninstallerset/pipeline-main-static-88dwc Updated "pipeline-main-static-88dwc" finalizers
default 16m Warning InternalError tektoninstallerset/pipeline-main-static-88dwc Operation cannot be fulfilled on configmaps "config-observability": the object has been modified; please apply your changes to the latest version and try again
default 16m Warning InternalError tektoninstallerset/pipeline-main-static-88dwc Internal error occurred: failed calling webhook "config.webhook.pipeline.tekton.dev": failed to call webhook: Post "https://tekton-pipelines-webhook.tekton-pipelines.svc:443/config-validation?timeout=10s": dial tcp 10.96.59.45:443: connect: connection refused
default 15m Warning FinalizerUpdateFailed tektoninstallerset/pipeline-main-static-88dwc Failed to update finalizers for "pipeline-main-static-88dwc": tektoninstallersets.operator.tekton.dev "pipeline-main-static-88dwc" not found
default 2m23s Normal FinalizerUpdate tektoninstallerset/pipeline-main-static-c8whj Updated "pipeline-main-static-c8whj" finalizers
default 3m8s Warning InternalError tektoninstallerset/pipeline-main-static-c8whj Operation cannot be fulfilled on configmaps "config-observability": the object has been modified; please apply your changes to the latest version and try again
default 2m55s Warning InternalError tektoninstallerset/pipeline-main-static-c8whj Internal error occurred: failed calling webhook "config.webhook.pipeline.tekton.dev": failed to call webhook: Post "https://tekton-pipelines-webhook.tekton-pipelines.svc:443/config-validation?timeout=10s": dial tcp 10.96.206.216:443: connect: connection refused
default 2m52s Warning InternalError tektoninstallerset/pipeline-main-static-c8whj Operation cannot be fulfilled on configmaps "config-logging": the object has been modified; please apply your changes to the latest version and try again
default 2m23s Warning FinalizerUpdateFailed tektoninstallerset/pipeline-main-static-c8whj Failed to update finalizers for "pipeline-main-static-c8whj": Operation cannot be fulfilled on tektoninstallersets.operator.tekton.dev "pipeline-main-static-c8whj": the object has been modified; please apply your changes to the latest version and try again
default 48s Normal FinalizerUpdate tektoninstallerset/pipeline-main-static-cncc6 Updated "pipeline-main-static-cncc6" finalizers
default 94s Warning InternalError tektoninstallerset/pipeline-main-static-cncc6 Operation cannot be fulfilled on configmaps "config-observability": the object has been modified; please apply your changes to the latest version and try again
default 79s Warning InternalError tektoninstallerset/pipeline-main-static-cncc6 Internal error occurred: failed calling webhook "config.webhook.pipeline.tekton.dev": failed to call webhook: Post "https://tekton-pipelines-webhook.tekton-pipelines.svc:443/config-validation?timeout=10s": dial tcp 10.96.165.31:443: connect: connection refused
default 48s Warning FinalizerUpdateFailed tektoninstallerset/pipeline-main-static-cncc6 Failed to update finalizers for "pipeline-main-static-cncc6": Operation cannot be fulfilled on tektoninstallersets.operator.tekton.dev "pipeline-main-static-cncc6": the object has been modified; please apply your changes to the latest version and try again
default 17m Normal FinalizerUpdate tektoninstallerset/pipeline-main-static-fclmd Updated "pipeline-main-static-fclmd" finalizers
default 18m Warning InternalError tektoninstallerset/pipeline-main-static-fclmd Operation cannot be fulfilled on configmaps "config-observability": the object has been modified; please apply your changes to the latest version and try again
default 18m Warning InternalError tektoninstallerset/pipeline-main-static-fclmd Internal error occurred: failed calling webhook "config.webhook.pipeline.tekton.dev": failed to call webhook: Post "https://tekton-pipelines-webhook.tekton-pipelines.svc:443/config-validation?timeout=10s": dial tcp 10.96.86.216:443: connect: connection refused
default 17m Warning InternalError tektoninstallerset/pipeline-main-static-fclmd roles.rbac.authorization.k8s.io "tekton-pipelines-leader-election" not found
default 17m Warning FinalizerUpdateFailed tektoninstallerset/pipeline-main-static-fclmd Failed to update finalizers for "pipeline-main-static-fclmd": Operation cannot be fulfilled on tektoninstallersets.operator.tekton.dev "pipeline-main-static-fclmd": the object has been modified; please apply your changes to the latest version and try again
default 17m Warning FinalizerUpdateFailed tektoninstallerset/pipeline-main-static-fclmd Failed to update finalizers for "pipeline-main-static-fclmd": tektoninstallersets.operator.tekton.dev "pipeline-main-static-fclmd" not found
default 17m Normal FinalizerUpdate tektoninstallerset/pipeline-main-static-fzc9j Updated "pipeline-main-static-fzc9j" finalizers
default 17m Warning InternalError tektoninstallerset/pipeline-main-static-fzc9j Operation cannot be fulfilled on configmaps "config-observability": the object has been modified; please apply your changes to the latest version and try again
default 24m Normal FinalizerUpdate tektoninstallerset/pipeline-main-static-hs4fv Updated "pipeline-main-static-hs4fv" finalizers
default 24m Warning InternalError tektoninstallerset/pipeline-main-static-hs4fv Operation cannot be fulfilled on configmaps "config-observability": the object has been modified; please apply your changes to the latest version and try again
default 19m Normal FinalizerUpdate tektoninstallerset/pipeline-main-static-hs4fv Updated "pipeline-main-static-hs4fv" finalizers
default 13m Normal FinalizerUpdate tektoninstallerset/pipeline-main-static-k29wx Updated "pipeline-main-static-k29wx" finalizers
default 14m Warning InternalError tektoninstallerset/pipeline-main-static-k29wx Operation cannot be fulfilled on configmaps "config-observability": the object has been modified; please apply your changes to the latest version and try again
default 14m Warning InternalError tektoninstallerset/pipeline-main-static-k29wx Internal error occurred: failed calling webhook "config.webhook.pipeline.tekton.dev": failed to call webhook: Post "https://tekton-pipelines-webhook.tekton-pipelines.svc:443/config-validation?timeout=10s": dial tcp 10.96.122.140:443: connect: connection refused
default 13m Warning FinalizerUpdateFailed tektoninstallerset/pipeline-main-static-k29wx Failed to update finalizers for "pipeline-main-static-k29wx": Operation cannot be fulfilled on tektoninstallersets.operator.tekton.dev "pipeline-main-static-k29wx": the object has been modified; please apply your changes to the latest version and try again
default 9m53s Normal FinalizerUpdate tektoninstallerset/pipeline-main-static-sbhjj Updated "pipeline-main-static-sbhjj" finalizers
default 9m50s Warning InternalError tektoninstallerset/pipeline-main-static-sbhjj Operation cannot be fulfilled on configmaps "config-observability": the object has been modified; please apply your changes to the latest version and try again
default 9m36s Warning InternalError tektoninstallerset/pipeline-main-static-sbhjj Internal error occurred: failed calling webhook "config.webhook.pipeline.tekton.dev": failed to call webhook: Post "https://tekton-pipelines-webhook.tekton-pipelines.svc:443/config-validation?timeout=10s": dial tcp 10.96.15.144:443: connect: connection refused
default 9m34s Warning InternalError tektoninstallerset/pipeline-main-static-sbhjj Operation cannot be fulfilled on configmaps "config-logging": the object has been modified; please apply your changes to the latest version and try again
default 4m Normal FinalizerUpdate tektoninstallerset/pipeline-main-static-sbhjj Updated "pipeline-main-static-sbhjj" finalizers
default 3m57s Warning FinalizerUpdateFailed tektoninstallerset/pipeline-main-static-sbhjj Failed to update finalizers for "pipeline-main-static-sbhjj": tektoninstallersets.operator.tekton.dev "pipeline-main-static-sbhjj" not found
default 12m Normal FinalizerUpdate tektoninstallerset/pipeline-main-static-tcqfb Updated "pipeline-main-static-tcqfb" finalizers
default 13m Warning InternalError tektoninstallerset/pipeline-main-static-tcqfb Operation cannot be fulfilled on configmaps "config-observability": the object has been modified; please apply your changes to the latest version and try again
default 12m Warning InternalError tektoninstallerset/pipeline-main-static-tcqfb Internal error occurred: failed calling webhook "config.webhook.pipeline.tekton.dev": failed to call webhook: Post "https://tekton-pipelines-webhook.tekton-pipelines.svc:443/config-validation?timeout=10s": dial tcp 10.96.84.181:443: connect: connection refused
default 12m Warning FinalizerUpdateFailed tektoninstallerset/pipeline-main-static-tcqfb Failed to update finalizers for "pipeline-main-static-tcqfb": Operation cannot be fulfilled on tektoninstallersets.operator.tekton.dev "pipeline-main-static-tcqfb": the object has been modified; please apply your changes to the latest version and try again
default 24m Normal FinalizerUpdate tektonpipeline/pipeline Updated "pipeline" finalizers
default 19m Normal FinalizerUpdate tektonpipeline/pipeline Updated "pipeline" finalizers
default 19m Warning FinalizerUpdateFailed tektonpipeline/pipeline Failed to update finalizers for "pipeline": tektonpipelines.operator.tekton.dev "pipeline" not found
default 17m Normal FinalizerUpdate tektonpipeline/pipeline Updated "pipeline" finalizers
default 17m Normal FinalizerUpdate tektonpipeline/pipeline Updated "pipeline" finalizers
default 15m Normal FinalizerUpdate tektonpipeline/pipeline Updated "pipeline" finalizers
default 15m Warning FinalizerUpdateFailed tektonpipeline/pipeline Failed to update finalizers for "pipeline": tektonpipelines.operator.tekton.dev "pipeline" not found
default 13m Normal FinalizerUpdate tektonpipeline/pipeline Updated "pipeline" finalizers
default 12m Normal FinalizerUpdate tektonpipeline/pipeline Updated "pipeline" finalizers
default 10m Normal FinalizerUpdate tektonpipeline/pipeline Updated "pipeline" finalizers
default 9m53s Normal FinalizerUpdate tektonpipeline/pipeline Updated "pipeline" finalizers
default 4m6s Normal FinalizerUpdate tektonpipeline/pipeline Updated "pipeline" finalizers
default 2m26s Normal FinalizerUpdate tektonpipeline/pipeline Updated "pipeline" finalizers
default 51s Normal FinalizerUpdate tektonpipeline/pipeline Updated "pipeline" finalizers
default 51s Warning FinalizerUpdateFailed tektonpipeline/pipeline Failed to update finalizers for "pipeline": tektonpipelines.operator.tekton.dev "pipeline" not found
default 23m Warning UpdateFailed clusterinterceptor/slack Failed to update status for "slack": Internal error occurred: failed calling webhook "webhook.triggers.tekton.dev": failed to call webhook: Post "https://tekton-triggers-webhook.tekton-pipelines.svc:443/defaulting?timeout=10s": dial tcp 10.96.222.174:443: connect: connection refused
default 12m Warning UpdateFailed clusterinterceptor/slack Failed to update status for "slack": Internal error occurred: failed calling webhook "webhook.triggers.tekton.dev": failed to call webhook: Post "https://tekton-triggers-webhook.tekton-pipelines.svc:443/defaulting?timeout=10s": dial tcp 10.96.178.22:443: connect: connection refused
default 4m32s Normal FinalizerUpdate tektoninstallerset/tekton-hub-api-frkss Updated "tekton-hub-api-frkss" finalizers
default 4m31s Warning FinalizerUpdateFailed tektoninstallerset/tekton-hub-api-frkss Failed to update finalizers for "tekton-hub-api-frkss": tektoninstallersets.operator.tekton.dev "tekton-hub-api-frkss" not found
default 6m32s Normal FinalizerUpdate tektoninstallerset/tekton-hub-api-h9khg Updated "tekton-hub-api-h9khg" finalizers
default 6m32s Warning FinalizerUpdateFailed tektoninstallerset/tekton-hub-api-h9khg Failed to update finalizers for "tekton-hub-api-h9khg": tektoninstallersets.operator.tekton.dev "tekton-hub-api-h9khg" not found
default 4m41s Normal FinalizerUpdate tektoninstallerset/tekton-hub-api-jkvdj Updated "tekton-hub-api-jkvdj" finalizers
default 7m42s Normal FinalizerUpdate tektoninstallerset/tekton-hub-api-qv5wr Updated "tekton-hub-api-qv5wr" finalizers
default 7m42s Warning FinalizerUpdateFailed tektoninstallerset/tekton-hub-api-qv5wr Failed to update finalizers for "tekton-hub-api-qv5wr": tektoninstallersets.operator.tekton.dev "tekton-hub-api-qv5wr" not found
default 7m42s Normal FinalizerUpdate tektoninstallerset/tekton-hub-db-969hv Updated "tekton-hub-db-969hv" finalizers
default 4m42s Normal FinalizerUpdate tektoninstallerset/tekton-hub-db-c9hs5 Updated "tekton-hub-db-c9hs5" finalizers
default 4m42s Warning FinalizerUpdateFailed tektoninstallerset/tekton-hub-db-c9hs5 Failed to update finalizers for "tekton-hub-db-c9hs5": tektoninstallersets.operator.tekton.dev "tekton-hub-db-c9hs5" not found
default 7m42s Normal FinalizerUpdate tektoninstallerset/tekton-hub-db-migration-5kxhg Updated "tekton-hub-db-migration-5kxhg" finalizers
default 8m8s Warning InternalError tektoninstallerset/tekton-hub-db-migration-5kxhg Job not successful
default 4m42s Normal FinalizerUpdate tektoninstallerset/tekton-hub-db-migration-6wv8l Updated "tekton-hub-db-migration-6wv8l" finalizers
default 5m33s Warning InternalError tektoninstallerset/tekton-hub-db-migration-6wv8l Job not successful
default 6m32s Normal FinalizerUpdate tektoninstallerset/tekton-hub-db-migration-8l9st Updated "tekton-hub-db-migration-8l9st" finalizers
default 6m57s Warning InternalError tektoninstallerset/tekton-hub-db-migration-8l9st Job not successful
default 4m32s Normal FinalizerUpdate tektoninstallerset/tekton-hub-db-migration-d7x8j Updated "tekton-hub-db-migration-d7x8j" finalizers
default 4m39s Warning InternalError tektoninstallerset/tekton-hub-db-migration-d7x8j Job not successful
default 4m32s Normal FinalizerUpdate tektoninstallerset/tekton-hub-ui-8dkbc Updated "tekton-hub-ui-8dkbc" finalizers
default 6m32s Normal FinalizerUpdate tektoninstallerset/tekton-hub-ui-tk4tz Updated "tekton-hub-ui-tk4tz" finalizers
default 4m34s Normal FinalizerUpdate tektoninstallerset/tekton-hub-ui-wfbtl Updated "tekton-hub-ui-wfbtl" finalizers
default 4m34s Warning FinalizerUpdateFailed tektoninstallerset/tekton-hub-ui-wfbtl Failed to update finalizers for "tekton-hub-ui-wfbtl": tektoninstallersets.operator.tekton.dev "tekton-hub-ui-wfbtl" not found
default 7m42s Normal FinalizerUpdate tektoninstallerset/tekton-hub-ui-wnkcm Updated "tekton-hub-ui-wnkcm" finalizers
default 23m Normal FinalizerUpdate tektoninstallerset/tektoncd-pruner-ffxnc Updated "tektoncd-pruner-ffxnc" finalizers
default 19m Normal FinalizerUpdate tektoninstallerset/tektoncd-pruner-ffxnc Updated "tektoncd-pruner-ffxnc" finalizers
default 17m Normal FinalizerUpdate tektoninstallerset/tektoncd-pruner-jxwn8 Updated "tektoncd-pruner-jxwn8" finalizers
default 9m11s Normal FinalizerUpdate tektoninstallerset/tektoncd-pruner-r9h2k Updated "tektoncd-pruner-r9h2k" finalizers
default 4m3s Normal FinalizerUpdate tektoninstallerset/tektoncd-pruner-r9h2k Updated "tektoncd-pruner-r9h2k" finalizers
default 15m Normal FinalizerUpdate tektoninstallerset/tektoncd-pruner-z26rd Updated "tektoncd-pruner-z26rd" finalizers
default 15m Normal FinalizerUpdate tektoninstallerset/trigger-main-deployment-45hzj Updated "trigger-main-deployment-45hzj" finalizers
default 17m Normal FinalizerUpdate tektoninstallerset/trigger-main-deployment-4pt5x Updated "trigger-main-deployment-4pt5x" finalizers
default 12m Normal FinalizerUpdate tektoninstallerset/trigger-main-deployment-jjmxj Updated "trigger-main-deployment-jjmxj" finalizers
default 12m Warning FinalizerUpdateFailed tektoninstallerset/trigger-main-deployment-jjmxj Failed to update finalizers for "trigger-main-deployment-jjmxj": Operation cannot be fulfilled on tektoninstallersets.operator.tekton.dev "trigger-main-deployment-jjmxj": the object has been modified; please apply your changes to the latest version and try again
default 23m Normal FinalizerUpdate tektoninstallerset/trigger-main-deployment-vgt9l Updated "trigger-main-deployment-vgt9l" finalizers
default 19m Normal FinalizerUpdate tektoninstallerset/trigger-main-deployment-vgt9l Updated "trigger-main-deployment-vgt9l" finalizers
default 9m25s Normal FinalizerUpdate tektoninstallerset/trigger-main-deployment-xf9n2 Updated "trigger-main-deployment-xf9n2" finalizers
default 4m6s Normal FinalizerUpdate tektoninstallerset/trigger-main-deployment-xf9n2 Updated "trigger-main-deployment-xf9n2" finalizers
default 23m Normal FinalizerUpdate tektoninstallerset/trigger-main-static-fcngs Updated "trigger-main-static-fcngs" finalizers
default 23m Warning InternalError tektoninstallerset/trigger-main-static-fcngs rolebindings.rbac.authorization.k8s.io "tekton-triggers-core-interceptors" already exists
... skipping 2 lines ...
default 15m Normal FinalizerUpdate tektoninstallerset/trigger-main-static-jprwm Updated "trigger-main-static-jprwm" finalizers
default 9m30s Normal FinalizerUpdate tektoninstallerset/trigger-main-static-pfmrr Updated "trigger-main-static-pfmrr" finalizers
default 9m27s Warning InternalError tektoninstallerset/trigger-main-static-pfmrr rolebindings.rbac.authorization.k8s.io "tekton-triggers-core-interceptors" already exists
default 4m4s Normal FinalizerUpdate tektoninstallerset/trigger-main-static-pfmrr Updated "trigger-main-static-pfmrr" finalizers
default 12m Normal FinalizerUpdate tektoninstallerset/trigger-main-static-wcw9x Updated "trigger-main-static-wcw9x" finalizers
default 12m Warning InternalError tektoninstallerset/trigger-main-static-wcw9x clusterinterceptors.triggers.tekton.dev "cel" already exists
default 12m Warning FinalizerUpdateFailed tektoninstallerset/trigger-main-static-wcw9x Failed to update finalizers for "trigger-main-static-wcw9x": Operation cannot be fulfilled on tektoninstallersets.operator.tekton.dev "trigger-main-static-wcw9x": the object has been modified; please apply your changes to the latest version and try again
default 23m Normal FinalizerUpdate tektontrigger/trigger Updated "trigger" finalizers
default 19m Normal FinalizerUpdate tektontrigger/trigger Updated "trigger" finalizers
default 17m Normal FinalizerUpdate tektontrigger/trigger Updated "trigger" finalizers
default 15m Normal FinalizerUpdate tektontrigger/trigger Updated "trigger" finalizers
default 12m Normal FinalizerUpdate tektontrigger/trigger Updated "trigger" finalizers
default 9m33s Normal FinalizerUpdate tektontrigger/trigger Updated "trigger" finalizers
... skipping 203 lines ...
tekton-operator 24m Normal Created pod/tekton-operator-webhook-6997b6bd5b-wqks5 Created container tekton-operator-webhook
tekton-operator 24m Normal Started pod/tekton-operator-webhook-6997b6bd5b-wqks5 Started container tekton-operator-webhook
tekton-operator 24m Normal SuccessfulCreate replicaset/tekton-operator-webhook-6997b6bd5b Created pod: tekton-operator-webhook-6997b6bd5b-wqks5
tekton-operator 24m Normal ScalingReplicaSet deployment/tekton-operator-webhook Scaled up replica set tekton-operator-webhook-6997b6bd5b to 1
tekton-operator 24m Normal ScalingReplicaSet deployment/tekton-operator Scaled up replica set tekton-operator-95b4868b4 to 1
***************************************
*** E2E TEST FAILED ***
*** End of information dump ***
***************************************
+ EXIT_VALUE=1
+ set +o xtrace
Cleaning up after docker in docker.
================================================================================
... skipping 4 lines ...