ResultFAILURE
Tests 0 failed / 0 succeeded
Started2025-01-23 23:57
Elapsed10m33s
Revision4604853a1bc8961235b98873e4c4dd59a177a7e2
Refs 8490

No Test Failures!


Error lines from build-log.txt

... skipping 102 lines ...
vendor/github.com/google/cel-go/common/ast/expr.go
vendor/github.com/google/cel-go/common/ast/factory.go
vendor/github.com/google/cel-go/common/ast/navigable.go
vendor/github.com/google/cel-go/common/containers/container.go
vendor/github.com/google/cel-go/common/debug/debug.go
vendor/github.com/google/cel-go/common/decls/decls.go
vendor/github.com/google/cel-go/common/error.go
vendor/github.com/google/cel-go/common/errors.go
vendor/github.com/google/cel-go/common/runes/buffer.go
vendor/github.com/google/cel-go/common/source.go
vendor/github.com/google/cel-go/common/stdlib/BUILD.bazel
vendor/github.com/google/cel-go/common/stdlib/standard.go
vendor/github.com/google/cel-go/common/types/BUILD.bazel
... skipping 2115 lines ...
Gererating CRD schema for /home/prow/go/src/github.com/tektoncd/pipeline/hack/../config/300-crds/300-verificationpolicy.yaml
/home/prow/go/src/github.com/tektoncd/pipeline/hack/update-schemas.sh: 38: [[: not found
/home/prow/go/src/github.com/tektoncd/pipeline/hack/update-schemas.sh: 38: [[: not found
/home/prow/go/src/github.com/tektoncd/pipeline/hack/update-schemas.sh: 38: [[: not found
/home/prow/go/src/github.com/tektoncd/pipeline/hack/update-schemas.sh: 38: [[: not found
/home/prow/go/src/github.com/tektoncd/pipeline/hack/update-schemas.sh: 38: [[: not found
[ERROR] Failed to generate CRD schema
-----------------------------------------
---- Checking for forbidden licenses ----
-----------------------------------------
============================
==== BUILD TESTS FAILED ====
============================
+ EXIT_VALUE=1
+ set +o xtrace