ResultFAILURE
Tests 0 failed / 0 succeeded
Started2025-03-10 09:07
Elapsed2m35s
Revision20132e6d026ced8bf6125edb072af71512364dd2
Refs 908

No Test Failures!


Error lines from build-log.txt

... skipping 74 lines ...
============================
==== RUNNING UNIT TESTS ====
============================
/home/prow/go/src/github.com/tektoncd/results /home/prow/go/src/github.com/tektoncd/results
Using overridden unit_tests
?   	github.com/tektoncd/results/cmd/cli-docs	[no test files]
2025/03/10 09:08:55 maxprocs: Leaving GOMAXPROCS=16: CPU quota undefined
=== RUN   Test_determineAuth
=== RUN   Test_determineAuth/missing_token
=== RUN   Test_determineAuth/invalid_token
=== RUN   Test_determineAuth/valid_token
--- PASS: Test_determineAuth (0.00s)
    --- PASS: Test_determineAuth/missing_token (0.00s)
... skipping 14 lines ...
          []string{
        - 	"a.b",
          	"d.e",
          	"f",
        + 	"a.b",
          }
--- FAIL: TestFieldMask_Paths (0.00s)
=== RUN   TestFieldMask_Filter
--- PASS: TestFieldMask_Filter (0.01s)
=== RUN   TestFieldMask_FilterJSON
--- PASS: TestFieldMask_FilterJSON (0.00s)
=== RUN   TestFromMetadata
--- PASS: TestFromMetadata (0.00s)
=== RUN   TestMetadataAnnotator
--- PASS: TestMetadataAnnotator (0.00s)
FAIL
FAIL	github.com/tektoncd/results/internal/fieldmask	0.046s
=== RUN   TestParseFilter
=== RUN   TestParseFilter/success
=== RUN   TestParseFilter/success/#00
=== RUN   TestParseFilter/success/result
=== RUN   TestParseFilter/success/result.id
=== RUN   TestParseFilter/success/result.id_==_"1"
=== RUN   TestParseFilter/success/result.id_==_"1"_||_result.name_==_"2"
=== RUN   TestParseFilter/success/result.id.startsWith("tacocat")
=== RUN   TestParseFilter/error
=== RUN   TestParseFilter/error/asdf
=== RUN   TestParseFilter/error/result.id_==_1
=== RUN   TestParseFilter/error/result.ID
--- PASS: TestParseFilter (0.02s)
    --- PASS: TestParseFilter/success (0.01s)
        --- PASS: TestParseFilter/success/#00 (0.00s)
        --- PASS: TestParseFilter/success/result (0.01s)
        --- PASS: TestParseFilter/success/result.id (0.00s)
        --- PASS: TestParseFilter/success/result.id_==_"1" (0.00s)
        --- PASS: TestParseFilter/success/result.id_==_"1"_||_result.name_==_"2" (0.00s)
        --- PASS: TestParseFilter/success/result.id.startsWith("tacocat") (0.00s)
    --- PASS: TestParseFilter/error (0.00s)
        --- PASS: TestParseFilter/error/asdf (0.00s)
        --- PASS: TestParseFilter/error/result.id_==_1 (0.00s)
        --- PASS: TestParseFilter/error/result.ID (0.00s)
PASS
ok  	github.com/tektoncd/results/pkg/api/server/cel	1.065s
=== RUN   TestConvertRecordExpressions
=== RUN   TestConvertRecordExpressions/simple_expression
    convert_test.go:170: want: (name = 'foo')
    convert_test.go:171: got:  (name = 'foo')
... skipping 356 lines ...
    db.go:69: /home/prow/go/src/github.com/tektoncd/results/pkg/api/server/v1alpha2/logs.go:352
        [0.907ms] [rows:3] SELECT * FROM `records` WHERE type = "results.tekton.dev/v1alpha3.Log" AND id > "" AND parent = "foo" AND result_name = "bar" ORDER BY created_time LIMIT 51
=== RUN   TestListLogs/unknown_type
=== RUN   TestListLogs/unknown_any_field
=== RUN   TestListLogs/invalid_page_size
=== RUN   TestListLogs/malformed_parent
{"level":"error","ts":1741597771.313399,"caller":"v1alpha2/logs.go:268","msg":"rpc error: code = InvalidArgument desc = name must match (^[a-z0-9_-]{1,63})/results/([a-z0-9_-]{1,63}$)","stacktrace":"github.com/tektoncd/results/pkg/api/server/v1alpha2.(*Server).ListLogs\n\t/home/prow/go/src/github.com/tektoncd/results/pkg/api/server/v1alpha2/logs.go:268\ngithub.com/tektoncd/results/pkg/api/server/v1alpha2.TestListLogs.func1\n\t/home/prow/go/src/github.com/tektoncd/results/pkg/api/server/v1alpha2/logs_test.go:569\ntesting.tRunner\n\t/usr/local/go/src/testing/testing.go:1690"}
=== RUN   TestListLogs/invalid_order_by_clause
=== RUN   TestListLogs/invalid_sort_direction
--- PASS: TestListLogs (0.50s)
    --- PASS: TestListLogs/all (0.04s)
    --- PASS: TestListLogs/list_all_records_without_knowing_the_result_name (0.03s)
    --- PASS: TestListLogs/list_all_records_without_knowing_the_parent_and_the_result_name (0.03s)
... skipping 171 lines ...
=== RUN   TestCreateRecord/missing_name
=== RUN   TestCreateRecord/result_used_as_name
=== RUN   TestCreateRecord/already_exists
=== NAME  TestCreateRecord
    db.go:69: /home/prow/go/src/github.com/tektoncd/results/pkg/api/server/v1alpha2/records.go:102
        [0.272ms] [rows:1] SELECT `results`.`name`,`results`.`id` FROM `results` WHERE `results`.`parent` = "foo" AND `results`.`name` = "bar" ORDER BY `results`.`id` LIMIT 1
    db.go:69: /home/prow/go/src/github.com/tektoncd/results/pkg/api/server/v1alpha2/records.go:82 UNIQUE constraint failed: records.parent, records.result_name, records.name
        [0.473ms] [rows:0] INSERT INTO `records` (`parent`,`result_id`,`result_name`,`id`,`name`,`type`,`data`,`etag`,`created_time`,`updated_time`) VALUES ("foo","25","bar","27","baz","TaskRun","{""metadata"":{""name"":""tacocat"",""creationTimestamp"":null},""spec"":{""serviceAccountName"":""""},""status"":{""podName"":""""}}","27-1741597773503177092","2025-03-10 09:09:33.503","2025-03-10 09:09:33.503") RETURNING `created_time`,`updated_time`
--- PASS: TestCreateRecord (0.07s)
    --- PASS: TestCreateRecord/success (0.02s)
    --- PASS: TestCreateRecord/mismatched_parent (0.00s)
    --- PASS: TestCreateRecord/parent_does_not_exist (0.00s)
    --- PASS: TestCreateRecord/missing_name (0.00s)
... skipping 13 lines ...
        [0.135ms] [rows:-] SELECT count(*) FROM sqlite_master WHERE type='table' AND name="records"
    db.go:69: /home/prow/go/src/github.com/tektoncd/results/pkg/api/server/v1alpha2/server.go:96
        [4.478ms] [rows:0] CREATE TABLE `records` (`parent` text,`result_id` text,`result_name` text,`id` text,`name` text,`type` text,`data` jsonb,`created_time` datetime DEFAULT current_timestamp,`updated_time` datetime DEFAULT current_timestamp,`etag` text,PRIMARY KEY (`parent`,`result_id`,`id`),CONSTRAINT `fk_records_result` FOREIGN KEY (`parent`,`result_id`) REFERENCES `results`(`parent`,`id`) ON DELETE CASCADE ON UPDATE CASCADE)
    db.go:69: /home/prow/go/src/github.com/tektoncd/results/pkg/api/server/v1alpha2/server.go:96
        [5.104ms] [rows:0] CREATE UNIQUE INDEX `records_by_name` ON `records`(`parent`,`result_name`,`name`)
{"level":"warn","ts":1741597771.7736454,"caller":"plugin/plugin_logs.go:429","msg":"Plugin Logs API Disable: unsupported type of logs given for plugin, legacy logging system might work"}
    db.go:69: /home/prow/go/src/github.com/tektoncd/results/pkg/api/server/v1alpha2/records.go:82 FOREIGN KEY constraint failed
        [0.976ms] [rows:0] INSERT INTO `records` (`parent`,`result_id`,`result_name`,`id`,`name`,`type`,`data`,`etag`,`created_time`,`updated_time`) VALUES ("foo","deleted","deleted","28","baz","","","28-1741597773503177092","2025-03-10 09:09:33.503","2025-03-10 09:09:33.503") RETURNING `created_time`,`updated_time`
--- PASS: TestCreateRecord_ConcurrentDelete (0.03s)
=== RUN   TestGetRecord
    records_test.go:185: test database:  /tmp/testdb4052421260
    db.go:69: /home/prow/go/src/github.com/tektoncd/results/pkg/api/server/test/db.go:59
        [0.033ms] [rows:0] PRAGMA foreign_keys = ON;
... skipping 439 lines ...
    db.go:69: /home/prow/go/src/github.com/tektoncd/results/pkg/api/server/v1alpha2/results.go:208
        [0.578ms] [rows:1] SELECT * FROM `results` WHERE `results`.`parent` = "foo" AND `results`.`name` = "bar" ORDER BY `results`.`id` LIMIT 1
=== RUN   TestCreateResult/mismatched_parent
=== RUN   TestCreateResult/missing_name
=== RUN   TestCreateResult/already_exists
=== NAME  TestCreateResult
    db.go:69: /home/prow/go/src/github.com/tektoncd/results/pkg/api/server/v1alpha2/results.go:72 UNIQUE constraint failed: results.parent, results.name
        [0.511ms] [rows:0] INSERT INTO `results` (`parent`,`id`,`name`,`annotations`,`recordsummary_record`,`recordsummary_type`,`recordsummary_start_time`,`recordsummary_end_time`,`recordsummary_status`,`recordsummary_annotations`,`etag`,`created_time`,`updated_time`) VALUES ("foo","40","bar","{""foo"":""bar""}","","",NULL,NULL,0,"null","40-1741597798503177092","2025-03-10 09:09:58.503","2025-03-10 09:09:58.503") RETURNING `created_time`,`updated_time`
=== RUN   TestCreateResult/large_name
=== RUN   TestCreateResult/large_result_summary_type
--- PASS: TestCreateResult (0.10s)
    --- PASS: TestCreateResult/success (0.01s)
    --- PASS: TestCreateResult/mismatched_parent (0.00s)
... skipping 901 lines ...
=== RUN   TestMatch/no_filter
=== RUN   TestMatch/matching_condition
=== RUN   TestMatch/non-matching_condition
=== RUN   TestMatch/nil_result
=== RUN   TestMatch/non-bool_output
=== RUN   TestMatch/wrong_resource_type
2025/03/10 09:09:30 failed to evaluate the expression: no such attribute(s): record
--- PASS: TestMatch (0.03s)
    --- PASS: TestMatch/no_filter (0.00s)
    --- PASS: TestMatch/matching_condition (0.02s)
    --- PASS: TestMatch/non-matching_condition (0.00s)
    --- PASS: TestMatch/nil_result (0.00s)
    --- PASS: TestMatch/non-bool_output (0.00s)
... skipping 390 lines ...
    db.go:69: /home/prow/go/src/github.com/tektoncd/results/pkg/api/server/v1alpha2/records.go:102
        [0.487ms] [rows:1] SELECT `results`.`name`,`results`.`id` FROM `results` WHERE `results`.`parent` = "ns" AND `results`.`name` = "12345" ORDER BY `results`.`id` LIMIT 1
    db.go:69: /home/prow/go/src/github.com/tektoncd/results/pkg/api/server/v1alpha2/records.go:82
        [8.013ms] [rows:1] INSERT INTO `records` (`parent`,`result_id`,`result_name`,`id`,`name`,`type`,`data`,`etag`,`created_time`,`updated_time`) VALUES ("ns","5d186b19-c479-4fc2-b2a7-406ea5074cec","12345","73a4fb4f-39e9-4dfe-8f34-92c9051015c5","125648b5-e706-323c-9089-124521d45c01","results.tekton.dev/v1alpha3.Log","{""kind"":""Log"",""apiVersion"":""results.tekton.dev/v1alpha3"",""metadata"":{""name"":""taskrun-log"",""namespace"":""ns"",""uid"":""125648b5-e706-323c-9089-124521d45c01"",""creationTimestamp"":null},""spec"":{""resource"":{""kind"":""TaskRun"",""namespace"":""ns"",""name"":""taskrun"",""uid"":""12345""},""type"":""File""},""status"":{""size"":0,""isStored"":false,""errorOnStoreMsg"":"""",""isRetryableErr"":false}}","73a4fb4f-39e9-4dfe-8f34-92c9051015c5-1741597788187593829","2025-03-10 09:09:48.187","2025-03-10 09:09:48.187") RETURNING `created_time`,`updated_time`
    logger.go:146: 2025-03-10T09:09:48.197Z	DEBUG	TestReconcile_TaskRun	dynamic/dynamic.go:289	Skipping CRD annotation patch: annotation update is disabled
    logger.go:146: 2025-03-10T09:09:48.197Z	DEBUG	TestReconcile_TaskRun	dynamic/dynamic.go:472	Streaming log started	{"namespace": "ns", "kind": "TaskRun", "name": "taskrun"}
    logger.go:146: 2025-03-10T09:09:48.198Z	ERROR	TestReconcile_TaskRun	dynamic/dynamic.go:480	Error streaming log	{"namespace": "ns", "kind": "TaskRun", "name": "taskrun", "error": "failed to create tkn reader: Parsing kubeconfig failed: invalid configuration: no configuration has been provided, try setting KUBERNETES_MASTER environment variable"}
    logger.go:146: 2025-03-10T09:09:48.198Z	INFO	TestReconcile_TaskRun	dynamic/dynamic.go:488	Streaming log completed	{"namespace": "ns", "kind": "TaskRun", "name": "taskrun"}
    db.go:69: /home/prow/go/src/github.com/tektoncd/results/pkg/api/server/v1alpha2/results.go:208
        [0.665ms] [rows:1] SELECT * FROM `results` WHERE `results`.`parent` = "ns" AND `results`.`name` = "12345" ORDER BY `results`.`id` LIMIT 1
    logger.go:146: 2025-03-10T09:09:48.201Z	DEBUG	TestReconcile_TaskRun	results/results.go:210	No further actions to be done on the Result: no differences found	{"results.tekton.dev/result": "ns/results/12345", "results.tekton.dev/record": "ns/results/12345/records/12345", "results.tekton.dev/top-level-record": true}
    db.go:69: /home/prow/go/src/github.com/tektoncd/results/pkg/api/server/v1alpha2/records.go:135 record not found
        [0.393ms] [rows:0] SELECT * FROM `records` WHERE `records`.`parent` = "ns" AND `records`.`result_name` = "12345" AND `records`.`name` = "f79267d9-8b19-3b5a-9b22-75a029f2e039" ORDER BY `records`.`id` LIMIT 1
... skipping 110 lines ...
    db.go:69: /home/prow/go/src/github.com/tektoncd/results/pkg/api/server/v1alpha2/records.go:135
        [0.693ms] [rows:1] SELECT * FROM `records` WHERE `records`.`parent` = "ns" AND `records`.`result_name` = "12345" AND `records`.`name` = "12345" ORDER BY `records`.`id` LIMIT 1
    logger.go:146: 2025-03-10T09:09:48.401Z	DEBUG	TestReconcile_TaskRun	results/results.go:326	Updating Record	{"results.tekton.dev/record": "ns/results/12345/records/12345"}
    db.go:69: /home/prow/go/src/github.com/tektoncd/results/pkg/api/server/v1alpha2/records.go:135
        [0.497ms] [rows:1] SELECT * FROM `records` WHERE `records`.`parent` = "ns" AND `records`.`result_name` = "12345" AND `records`.`name` = "12345" ORDER BY `records`.`id` LIMIT 1
    db.go:69: /home/prow/go/src/github.com/tektoncd/results/pkg/api/server/v1alpha2/records.go:217
        [0.518ms] [rows:1] UPDATE `records` SET `result_name`="12345",`name`="12345",`type`="tekton.dev/v1.TaskRun",`data`="{""kind"":""TaskRun"",""apiVersion"":""tekton.dev/v1"",""metadata"":{""name"":""taskrun"",""namespace"":""ns"",""uid"":""12345"",""creationTimestamp"":null,""annotations"":{""demo"":""demo""}},""spec"":{""serviceAccountName"":"""",""taskSpec"":{""steps"":[{""name"":"""",""computeResources"":{},""script"":""echo hello world!""}]}},""status"":{""conditions"":[{""type"":""Succeeded"",""status"":""False"",""lastTransitionTime"":""2025-03-10T09:09:48Z"",""reason"":""Failed"",""message"":""Failed""}],""podName"":"""",""startTime"":""2025-03-10T09:09:48Z"",""completionTime"":""2025-03-10T09:09:49Z""}}",`created_time`="2025-03-10 09:09:48.051",`updated_time`="2025-03-10 09:09:48.404",`etag`="d7abd430-d841-4e46-be8c-cc4b3ef02290-1741597788404119876" WHERE `parent` = "ns" AND `result_id` = "5d186b19-c479-4fc2-b2a7-406ea5074cec" AND `id` = "d7abd430-d841-4e46-be8c-cc4b3ef02290"
    db.go:69: /home/prow/go/src/github.com/tektoncd/results/pkg/api/server/v1alpha2/results.go:208
        [0.595ms] [rows:1] SELECT * FROM `results` WHERE `results`.`parent` = "ns" AND `results`.`name` = "12345" ORDER BY `results`.`id` LIMIT 1
    logger.go:146: 2025-03-10T09:09:48.414Z	DEBUG	TestReconcile_TaskRun	results/results.go:210	No further actions to be done on the Result: no differences found	{"results.tekton.dev/result": "ns/results/12345", "results.tekton.dev/record": "ns/results/12345/records/12345", "results.tekton.dev/top-level-record": true}
    db.go:69: /home/prow/go/src/github.com/tektoncd/results/pkg/api/server/v1alpha2/records.go:135
        [0.404ms] [rows:1] SELECT * FROM `records` WHERE `records`.`parent` = "ns" AND `records`.`result_name` = "12345" AND `records`.`name` = "125648b5-e706-323c-9089-124521d45c01" ORDER BY `records`.`id` LIMIT 1
    db.go:69: /home/prow/go/src/github.com/tektoncd/results/pkg/api/server/v1alpha2/results.go:208
... skipping 34 lines ...
    db.go:69: /home/prow/go/src/github.com/tektoncd/results/pkg/api/server/v1alpha2/records.go:135
        [0.519ms] [rows:1] SELECT * FROM `records` WHERE `records`.`parent` = "ns" AND `records`.`result_name` = "12345" AND `records`.`name` = "12345" ORDER BY `records`.`id` LIMIT 1
    logger.go:146: 2025-03-10T09:09:48.471Z	DEBUG	TestReconcile_TaskRun	results/results.go:326	Updating Record	{"results.tekton.dev/record": "ns/results/12345/records/12345"}
    db.go:69: /home/prow/go/src/github.com/tektoncd/results/pkg/api/server/v1alpha2/records.go:135
        [0.482ms] [rows:1] SELECT * FROM `records` WHERE `records`.`parent` = "ns" AND `records`.`result_name` = "12345" AND `records`.`name` = "12345" ORDER BY `records`.`id` LIMIT 1
    db.go:69: /home/prow/go/src/github.com/tektoncd/results/pkg/api/server/v1alpha2/records.go:217
        [2.164ms] [rows:1] UPDATE `records` SET `result_name`="12345",`name`="12345",`type`="tekton.dev/v1.TaskRun",`data`="{""kind"":""TaskRun"",""apiVersion"":""tekton.dev/v1"",""metadata"":{""name"":""taskrun"",""namespace"":""ns"",""uid"":""12345"",""creationTimestamp"":null,""labels"":{""x"":""foo""},""annotations"":{""demo"":""demo""}},""spec"":{""serviceAccountName"":"""",""taskSpec"":{""steps"":[{""name"":"""",""computeResources"":{},""script"":""echo hello world!""}]}},""status"":{""conditions"":[{""type"":""Succeeded"",""status"":""False"",""lastTransitionTime"":""2025-03-10T09:09:48Z"",""reason"":""Failed"",""message"":""Failed""}],""podName"":"""",""startTime"":""2025-03-10T09:09:48Z"",""completionTime"":""2025-03-10T09:09:49Z""}}",`created_time`="2025-03-10 09:09:48.051",`updated_time`="2025-03-10 09:09:48.474",`etag`="d7abd430-d841-4e46-be8c-cc4b3ef02290-1741597788474030975" WHERE `parent` = "ns" AND `result_id` = "5d186b19-c479-4fc2-b2a7-406ea5074cec" AND `id` = "d7abd430-d841-4e46-be8c-cc4b3ef02290"
    db.go:69: /home/prow/go/src/github.com/tektoncd/results/pkg/api/server/v1alpha2/results.go:208
        [0.557ms] [rows:1] SELECT * FROM `results` WHERE `results`.`parent` = "ns" AND `results`.`name` = "12345" ORDER BY `results`.`id` LIMIT 1
    logger.go:146: 2025-03-10T09:09:48.487Z	DEBUG	TestReconcile_TaskRun	results/results.go:210	No further actions to be done on the Result: no differences found	{"results.tekton.dev/result": "ns/results/12345", "results.tekton.dev/record": "ns/results/12345/records/12345", "results.tekton.dev/top-level-record": true}
    db.go:69: /home/prow/go/src/github.com/tektoncd/results/pkg/api/server/v1alpha2/records.go:135
        [0.518ms] [rows:1] SELECT * FROM `records` WHERE `records`.`parent` = "ns" AND `records`.`result_name` = "12345" AND `records`.`name` = "125648b5-e706-323c-9089-124521d45c01" ORDER BY `records`.`id` LIMIT 1
    db.go:69: /home/prow/go/src/github.com/tektoncd/results/pkg/api/server/v1alpha2/results.go:208
... skipping 52 lines ...
    db.go:69: /home/prow/go/src/github.com/tektoncd/results/pkg/api/server/v1alpha2/records.go:135
        [0.497ms] [rows:1] SELECT * FROM `records` WHERE `records`.`parent` = "ns" AND `records`.`result_name` = "12345" AND `records`.`name` = "12345" ORDER BY `records`.`id` LIMIT 1
    logger.go:146: 2025-03-10T09:09:48.577Z	DEBUG	TestReconcile_TaskRun	results/results.go:326	Updating Record	{"results.tekton.dev/record": "ns/results/12345/records/12345"}
    db.go:69: /home/prow/go/src/github.com/tektoncd/results/pkg/api/server/v1alpha2/records.go:135
        [0.576ms] [rows:1] SELECT * FROM `records` WHERE `records`.`parent` = "ns" AND `records`.`result_name` = "12345" AND `records`.`name` = "12345" ORDER BY `records`.`id` LIMIT 1
    db.go:69: /home/prow/go/src/github.com/tektoncd/results/pkg/api/server/v1alpha2/records.go:217
        [0.600ms] [rows:1] UPDATE `records` SET `result_name`="12345",`name`="12345",`type`="tekton.dev/v1.TaskRun",`data`="{""kind"":""TaskRun"",""apiVersion"":""tekton.dev/v1"",""metadata"":{""name"":""taskrun"",""namespace"":""ns"",""uid"":""12345"",""creationTimestamp"":null,""labels"":{""x"":""foo""},""annotations"":{""x"":""foo""}},""spec"":{""serviceAccountName"":"""",""taskSpec"":{""steps"":[{""name"":"""",""computeResources"":{},""script"":""echo hello world!""}]}},""status"":{""conditions"":[{""type"":""Succeeded"",""status"":""False"",""lastTransitionTime"":""2025-03-10T09:09:48Z"",""reason"":""Failed"",""message"":""Failed""}],""podName"":"""",""startTime"":""2025-03-10T09:09:48Z"",""completionTime"":""2025-03-10T09:09:49Z""}}",`created_time`="2025-03-10 09:09:48.051",`updated_time`="2025-03-10 09:09:48.579",`etag`="d7abd430-d841-4e46-be8c-cc4b3ef02290-1741597788579456834" WHERE `parent` = "ns" AND `result_id` = "5d186b19-c479-4fc2-b2a7-406ea5074cec" AND `id` = "d7abd430-d841-4e46-be8c-cc4b3ef02290"
    db.go:69: /home/prow/go/src/github.com/tektoncd/results/pkg/api/server/v1alpha2/results.go:208
        [0.690ms] [rows:1] SELECT * FROM `results` WHERE `results`.`parent` = "ns" AND `results`.`name` = "12345" ORDER BY `results`.`id` LIMIT 1
    logger.go:146: 2025-03-10T09:09:48.592Z	DEBUG	TestReconcile_TaskRun	results/results.go:210	No further actions to be done on the Result: no differences found	{"results.tekton.dev/result": "ns/results/12345", "results.tekton.dev/record": "ns/results/12345/records/12345", "results.tekton.dev/top-level-record": true}
    db.go:69: /home/prow/go/src/github.com/tektoncd/results/pkg/api/server/v1alpha2/records.go:135
        [0.343ms] [rows:1] SELECT * FROM `records` WHERE `records`.`parent` = "ns" AND `records`.`result_name` = "12345" AND `records`.`name` = "125648b5-e706-323c-9089-124521d45c01" ORDER BY `records`.`id` LIMIT 1
    db.go:69: /home/prow/go/src/github.com/tektoncd/results/pkg/api/server/v1alpha2/results.go:208
... skipping 14 lines ...
    db.go:69: /home/prow/go/src/github.com/tektoncd/results/pkg/api/server/v1alpha2/records.go:135
        [0.381ms] [rows:1] SELECT * FROM `records` WHERE `records`.`parent` = "ns" AND `records`.`result_name` = "12345" AND `records`.`name` = "12345" ORDER BY `records`.`id` LIMIT 1
    logger.go:146: 2025-03-10T09:09:48.624Z	DEBUG	TestReconcile_TaskRun	results/results.go:326	Updating Record	{"results.tekton.dev/record": "ns/results/12345/records/12345"}
    db.go:69: /home/prow/go/src/github.com/tektoncd/results/pkg/api/server/v1alpha2/records.go:135
        [0.491ms] [rows:1] SELECT * FROM `records` WHERE `records`.`parent` = "ns" AND `records`.`result_name` = "12345" AND `records`.`name` = "12345" ORDER BY `records`.`id` LIMIT 1
    db.go:69: /home/prow/go/src/github.com/tektoncd/results/pkg/api/server/v1alpha2/records.go:217
        [0.484ms] [rows:1] UPDATE `records` SET `result_name`="12345",`name`="12345",`type`="tekton.dev/v1.TaskRun",`data`="{""kind"":""TaskRun"",""apiVersion"":""tekton.dev/v1"",""metadata"":{""name"":""taskrun"",""namespace"":""ns"",""uid"":""12345"",""creationTimestamp"":null,""labels"":{""x"":""foo""},""annotations"":{""x"":""foo""},""ownerReferences"":[{""apiVersion"":""v1"",""kind"":""test"",""name"":""test-owner"",""uid"":""""}]},""spec"":{""serviceAccountName"":"""",""taskSpec"":{""steps"":[{""name"":"""",""computeResources"":{},""script"":""echo hello world!""}]}},""status"":{""conditions"":[{""type"":""Succeeded"",""status"":""False"",""lastTransitionTime"":""2025-03-10T09:09:48Z"",""reason"":""Failed"",""message"":""Failed""}],""podName"":"""",""startTime"":""2025-03-10T09:09:48Z"",""completionTime"":""2025-03-10T09:09:49Z""}}",`created_time`="2025-03-10 09:09:48.051",`updated_time`="2025-03-10 09:09:48.626",`etag`="d7abd430-d841-4e46-be8c-cc4b3ef02290-1741597788626711913" WHERE `parent` = "ns" AND `result_id` = "5d186b19-c479-4fc2-b2a7-406ea5074cec" AND `id` = "d7abd430-d841-4e46-be8c-cc4b3ef02290"
    db.go:69: /home/prow/go/src/github.com/tektoncd/results/pkg/api/server/v1alpha2/results.go:208
        [0.870ms] [rows:1] SELECT * FROM `results` WHERE `results`.`parent` = "ns" AND `results`.`name` = "12345" ORDER BY `results`.`id` LIMIT 1
    logger.go:146: 2025-03-10T09:09:48.663Z	DEBUG	TestReconcile_TaskRun	results/results.go:202	No further actions to be done on the Result: the object is not a top level record	{"results.tekton.dev/result": "ns/results/12345", "results.tekton.dev/record": "ns/results/12345/records/12345", "results.tekton.dev/top-level-record": false}
    db.go:69: /home/prow/go/src/github.com/tektoncd/results/pkg/api/server/v1alpha2/records.go:135
        [0.782ms] [rows:1] SELECT * FROM `records` WHERE `records`.`parent` = "ns" AND `records`.`result_name` = "12345" AND `records`.`name` = "125648b5-e706-323c-9089-124521d45c01" ORDER BY `records`.`id` LIMIT 1
    db.go:69: /home/prow/go/src/github.com/tektoncd/results/pkg/api/server/v1alpha2/results.go:208
... skipping 16 lines ...
    db.go:69: /home/prow/go/src/github.com/tektoncd/results/pkg/api/server/v1alpha2/records.go:135 record not found
        [0.520ms] [rows:0] SELECT * FROM `records` WHERE `records`.`parent` = "ns" AND `records`.`result_name` = "0b56acda-1707-4126-b7fe-c6958480b891" AND `records`.`name` = "12345" ORDER BY `records`.`id` LIMIT 1
    logger.go:146: 2025-03-10T09:09:48.692Z	DEBUG	TestReconcile_TaskRun	results/results.go:334	Record doesn't exist yet - creating	{"results.tekton.dev/record": "ns/results/0b56acda-1707-4126-b7fe-c6958480b891/records/12345"}
    db.go:69: /home/prow/go/src/github.com/tektoncd/results/pkg/api/server/v1alpha2/records.go:102
        [0.421ms] [rows:1] SELECT `results`.`name`,`results`.`id` FROM `results` WHERE `results`.`parent` = "ns" AND `results`.`name` = "0b56acda-1707-4126-b7fe-c6958480b891" ORDER BY `results`.`id` LIMIT 1
    db.go:69: /home/prow/go/src/github.com/tektoncd/results/pkg/api/server/v1alpha2/records.go:82
        [5.751ms] [rows:1] INSERT INTO `records` (`parent`,`result_id`,`result_name`,`id`,`name`,`type`,`data`,`etag`,`created_time`,`updated_time`) VALUES ("ns","d26d01c3-8998-4122-bf73-8e2673b3b016","0b56acda-1707-4126-b7fe-c6958480b891","a20e3593-cce9-4683-9e0e-bdf038fca159","12345","tekton.dev/v1.TaskRun","{""kind"":""TaskRun"",""apiVersion"":""tekton.dev/v1"",""metadata"":{""name"":""taskrun"",""namespace"":""ns"",""uid"":""12345"",""creationTimestamp"":null,""labels"":{""x"":""foo""},""annotations"":{""x"":""foo""},""ownerReferences"":[{""apiVersion"":""tekton.dev/v1"",""kind"":""PipelineRun"",""name"":""test-pipelinerun"",""uid"":""0b56acda-1707-4126-b7fe-c6958480b891""}]},""spec"":{""serviceAccountName"":"""",""taskSpec"":{""steps"":[{""name"":"""",""computeResources"":{},""script"":""echo hello world!""}]}},""status"":{""conditions"":[{""type"":""Succeeded"",""status"":""False"",""lastTransitionTime"":""2025-03-10T09:09:48Z"",""reason"":""Failed"",""message"":""Failed""}],""podName"":"""",""startTime"":""2025-03-10T09:09:48Z"",""completionTime"":""2025-03-10T09:09:49Z""}}","a20e3593-cce9-4683-9e0e-bdf038fca159-1741597788694696752","2025-03-10 09:09:48.694","2025-03-10 09:09:48.694") RETURNING `created_time`,`updated_time`
    db.go:69: /home/prow/go/src/github.com/tektoncd/results/pkg/api/server/v1alpha2/results.go:208
        [0.529ms] [rows:1] SELECT * FROM `results` WHERE `results`.`parent` = "ns" AND `results`.`name` = "0b56acda-1707-4126-b7fe-c6958480b891" ORDER BY `results`.`id` LIMIT 1
    logger.go:146: 2025-03-10T09:09:48.703Z	DEBUG	TestReconcile_TaskRun	results/results.go:202	No further actions to be done on the Result: the object is not a top level record	{"results.tekton.dev/result": "ns/results/0b56acda-1707-4126-b7fe-c6958480b891", "results.tekton.dev/record": "ns/results/0b56acda-1707-4126-b7fe-c6958480b891/records/12345", "results.tekton.dev/top-level-record": false}
    db.go:69: /home/prow/go/src/github.com/tektoncd/results/pkg/api/server/v1alpha2/records.go:135 record not found
        [0.378ms] [rows:0] SELECT * FROM `records` WHERE `records`.`parent` = "ns" AND `records`.`result_name` = "0b56acda-1707-4126-b7fe-c6958480b891" AND `records`.`name` = "b15e5b0c-de0f-34c3-82b0-0ef010bc355d" ORDER BY `records`.`id` LIMIT 1
    db.go:69: /home/prow/go/src/github.com/tektoncd/results/pkg/api/server/v1alpha2/results.go:208
... skipping 3 lines ...
        [0.267ms] [rows:0] SELECT * FROM `records` WHERE `records`.`parent` = "ns" AND `records`.`result_name` = "0b56acda-1707-4126-b7fe-c6958480b891" AND `records`.`name` = "b15e5b0c-de0f-34c3-82b0-0ef010bc355d" ORDER BY `records`.`id` LIMIT 1
    db.go:69: /home/prow/go/src/github.com/tektoncd/results/pkg/api/server/v1alpha2/records.go:102
        [0.481ms] [rows:1] SELECT `results`.`name`,`results`.`id` FROM `results` WHERE `results`.`parent` = "ns" AND `results`.`name` = "0b56acda-1707-4126-b7fe-c6958480b891" ORDER BY `results`.`id` LIMIT 1
    db.go:69: /home/prow/go/src/github.com/tektoncd/results/pkg/api/server/v1alpha2/records.go:82
        [7.895ms] [rows:1] INSERT INTO `records` (`parent`,`result_id`,`result_name`,`id`,`name`,`type`,`data`,`etag`,`created_time`,`updated_time`) VALUES ("ns","d26d01c3-8998-4122-bf73-8e2673b3b016","0b56acda-1707-4126-b7fe-c6958480b891","21888154-e972-46a3-9768-6876a965e755","b15e5b0c-de0f-34c3-82b0-0ef010bc355d","results.tekton.dev/v1alpha3.Log","{""kind"":""Log"",""apiVersion"":""results.tekton.dev/v1alpha3"",""metadata"":{""name"":""taskrun-log"",""namespace"":""ns"",""uid"":""b15e5b0c-de0f-34c3-82b0-0ef010bc355d"",""creationTimestamp"":null},""spec"":{""resource"":{""kind"":""TaskRun"",""namespace"":""ns"",""name"":""taskrun"",""uid"":""12345""},""type"":""File""},""status"":{""size"":0,""isStored"":false,""errorOnStoreMsg"":"""",""isRetryableErr"":false}}","21888154-e972-46a3-9768-6876a965e755-1741597788712621932","2025-03-10 09:09:48.712","2025-03-10 09:09:48.712") RETURNING `created_time`,`updated_time`
    logger.go:146: 2025-03-10T09:09:48.723Z	DEBUG	TestReconcile_TaskRun	dynamic/dynamic.go:472	Streaming log started	{"namespace": "ns", "kind": "TaskRun", "name": "taskrun"}
    logger.go:146: 2025-03-10T09:09:48.724Z	ERROR	TestReconcile_TaskRun	dynamic/dynamic.go:480	Error streaming log	{"namespace": "ns", "kind": "TaskRun", "name": "taskrun", "error": "failed to create tkn reader: Parsing kubeconfig failed: invalid configuration: no configuration has been provided, try setting KUBERNETES_MASTER environment variable"}
    logger.go:146: 2025-03-10T09:09:48.724Z	INFO	TestReconcile_TaskRun	dynamic/dynamic.go:488	Streaming log completed	{"namespace": "ns", "kind": "TaskRun", "name": "taskrun"}
    db.go:69: /home/prow/go/src/github.com/tektoncd/results/pkg/api/server/v1alpha2/results.go:208
        [0.535ms] [rows:1] SELECT * FROM `results` WHERE `results`.`parent` = "ns" AND `results`.`name` = "0b56acda-1707-4126-b7fe-c6958480b891" ORDER BY `results`.`id` LIMIT 1
    logger.go:146: 2025-03-10T09:09:48.726Z	DEBUG	TestReconcile_TaskRun	results/results.go:202	No further actions to be done on the Result: the object is not a top level record	{"results.tekton.dev/result": "ns/results/0b56acda-1707-4126-b7fe-c6958480b891", "results.tekton.dev/record": "ns/results/0b56acda-1707-4126-b7fe-c6958480b891/records/12345", "results.tekton.dev/top-level-record": false}
    db.go:69: /home/prow/go/src/github.com/tektoncd/results/pkg/api/server/v1alpha2/records.go:135 record not found
        [0.607ms] [rows:0] SELECT * FROM `records` WHERE `records`.`parent` = "ns" AND `records`.`result_name` = "0b56acda-1707-4126-b7fe-c6958480b891" AND `records`.`name` = "0a04acf7-0a96-37d1-a5f9-04a8c8e0a066" ORDER BY `records`.`id` LIMIT 1
... skipping 18 lines ...
    db.go:69: /home/prow/go/src/github.com/tektoncd/results/pkg/api/server/v1alpha2/records.go:135
        [0.559ms] [rows:1] SELECT * FROM `records` WHERE `records`.`parent` = "ns" AND `records`.`result_name` = "12345" AND `records`.`name` = "12345" ORDER BY `records`.`id` LIMIT 1
    logger.go:146: 2025-03-10T09:09:48.763Z	DEBUG	TestReconcile_TaskRun	results/results.go:326	Updating Record	{"results.tekton.dev/record": "ns/results/12345/records/12345"}
    db.go:69: /home/prow/go/src/github.com/tektoncd/results/pkg/api/server/v1alpha2/records.go:135
        [0.468ms] [rows:1] SELECT * FROM `records` WHERE `records`.`parent` = "ns" AND `records`.`result_name` = "12345" AND `records`.`name` = "12345" ORDER BY `records`.`id` LIMIT 1
    db.go:69: /home/prow/go/src/github.com/tektoncd/results/pkg/api/server/v1alpha2/records.go:217
        [0.520ms] [rows:1] UPDATE `records` SET `result_name`="12345",`name`="12345",`type`="tekton.dev/v1.TaskRun",`data`="{""kind"":""TaskRun"",""apiVersion"":""tekton.dev/v1"",""metadata"":{""name"":""taskrun"",""namespace"":""ns"",""uid"":""12345"",""creationTimestamp"":null,""labels"":{""x"":""foo""},""annotations"":{""x"":""foo""},""ownerReferences"":[{""apiVersion"":""v1"",""kind"":""test"",""name"":""test-owner"",""uid"":""52c6f724-ac97-4788-9185-30229f01d6f2""}]},""spec"":{""serviceAccountName"":"""",""taskSpec"":{""steps"":[{""name"":"""",""computeResources"":{},""script"":""echo hello world!""}]}},""status"":{""conditions"":[{""type"":""Succeeded"",""status"":""False"",""lastTransitionTime"":""2025-03-10T09:09:48Z"",""reason"":""Failed"",""message"":""Failed""}],""podName"":"""",""startTime"":""2025-03-10T09:09:48Z"",""completionTime"":""2025-03-10T09:09:49Z""}}",`created_time`="2025-03-10 09:09:48.051",`updated_time`="2025-03-10 09:09:48.765",`etag`="d7abd430-d841-4e46-be8c-cc4b3ef02290-1741597788765878071" WHERE `parent` = "ns" AND `result_id` = "5d186b19-c479-4fc2-b2a7-406ea5074cec" AND `id` = "d7abd430-d841-4e46-be8c-cc4b3ef02290"
    db.go:69: /home/prow/go/src/github.com/tektoncd/results/pkg/api/server/v1alpha2/results.go:208
        [0.720ms] [rows:1] SELECT * FROM `results` WHERE `results`.`parent` = "ns" AND `results`.`name` = "12345" ORDER BY `results`.`id` LIMIT 1
    logger.go:146: 2025-03-10T09:09:48.774Z	DEBUG	TestReconcile_TaskRun	results/results.go:202	No further actions to be done on the Result: the object is not a top level record	{"results.tekton.dev/result": "ns/results/12345", "results.tekton.dev/record": "ns/results/12345/records/12345", "results.tekton.dev/top-level-record": false}
    db.go:69: /home/prow/go/src/github.com/tektoncd/results/pkg/api/server/v1alpha2/records.go:135
        [0.530ms] [rows:1] SELECT * FROM `records` WHERE `records`.`parent` = "ns" AND `records`.`result_name` = "12345" AND `records`.`name` = "125648b5-e706-323c-9089-124521d45c01" ORDER BY `records`.`id` LIMIT 1
    db.go:69: /home/prow/go/src/github.com/tektoncd/results/pkg/api/server/v1alpha2/results.go:208
... skipping 57 lines ...
        [0.308ms] [rows:0] SELECT * FROM `records` WHERE `records`.`parent` = "ns" AND `records`.`result_name` = "12345" AND `records`.`name` = "35163d29-6723-3062-9572-70660a90d02a" ORDER BY `records`.`id` LIMIT 1
    db.go:69: /home/prow/go/src/github.com/tektoncd/results/pkg/api/server/v1alpha2/records.go:102
        [0.510ms] [rows:1] SELECT `results`.`name`,`results`.`id` FROM `results` WHERE `results`.`parent` = "ns" AND `results`.`name` = "12345" ORDER BY `results`.`id` LIMIT 1
    db.go:69: /home/prow/go/src/github.com/tektoncd/results/pkg/api/server/v1alpha2/records.go:82
        [29.916ms] [rows:1] INSERT INTO `records` (`parent`,`result_id`,`result_name`,`id`,`name`,`type`,`data`,`etag`,`created_time`,`updated_time`) VALUES ("ns","631a043b-b7ce-4f97-90f1-144c6fc3ba8f","12345","02419a7c-f5ea-4c0d-a47b-28b0d33a50bb","35163d29-6723-3062-9572-70660a90d02a","results.tekton.dev/v1alpha3.Log","{""kind"":""Log"",""apiVersion"":""results.tekton.dev/v1alpha3"",""metadata"":{""name"":""pipelinerun-log"",""namespace"":""ns"",""uid"":""35163d29-6723-3062-9572-70660a90d02a"",""creationTimestamp"":null},""spec"":{""resource"":{""kind"":""PipelineRun"",""namespace"":""ns"",""name"":""pipelinerun"",""uid"":""12345""},""type"":""File""},""status"":{""size"":0,""isStored"":false,""errorOnStoreMsg"":"""",""isRetryableErr"":false}}","02419a7c-f5ea-4c0d-a47b-28b0d33a50bb-1741597788854900749","2025-03-10 09:09:48.854","2025-03-10 09:09:48.854") RETURNING `created_time`,`updated_time`
    logger.go:146: 2025-03-10T09:09:48.888Z	DEBUG	TestReconcile_PipelineRun	dynamic/dynamic.go:472	Streaming log started	{"namespace": "ns", "kind": "PipelineRun", "name": "pipelinerun"}
    logger.go:146: 2025-03-10T09:09:48.889Z	ERROR	TestReconcile_PipelineRun	dynamic/dynamic.go:480	Error streaming log	{"namespace": "ns", "kind": "PipelineRun", "name": "pipelinerun", "error": "failed to create tkn reader: Parsing kubeconfig failed: invalid configuration: no configuration has been provided, try setting KUBERNETES_MASTER environment variable"}
    logger.go:146: 2025-03-10T09:09:48.889Z	INFO	TestReconcile_PipelineRun	dynamic/dynamic.go:488	Streaming log completed	{"namespace": "ns", "kind": "PipelineRun", "name": "pipelinerun"}
    db.go:69: /home/prow/go/src/github.com/tektoncd/results/pkg/api/server/v1alpha2/results.go:208
        [0.522ms] [rows:1] SELECT * FROM `results` WHERE `results`.`parent` = "ns" AND `results`.`name` = "12345" ORDER BY `results`.`id` LIMIT 1
    logger.go:146: 2025-03-10T09:09:48.892Z	DEBUG	TestReconcile_PipelineRun	results/results.go:210	No further actions to be done on the Result: no differences found	{"results.tekton.dev/result": "ns/results/12345", "results.tekton.dev/record": "ns/results/12345/records/12345", "results.tekton.dev/top-level-record": true}
    db.go:69: /home/prow/go/src/github.com/tektoncd/results/pkg/api/server/v1alpha2/records.go:135 record not found
        [0.452ms] [rows:0] SELECT * FROM `records` WHERE `records`.`parent` = "ns" AND `records`.`result_name` = "12345" AND `records`.`name` = "deb45925-40dd-3e0e-94bb-b3bbc708e409" ORDER BY `records`.`id` LIMIT 1
... skipping 399 lines ...
        --- PASS: TestPut/pipelinerun/update (0.01s)
PASS
ok  	github.com/tektoncd/results/pkg/watcher/results	2.548s
testing: warning: no tests to run
PASS
ok  	github.com/tektoncd/results/tools/postgres-migrate	1.057s [no tests to run]
FAIL
unit_tests returning 
===========================
==== UNIT TESTS FAILED ====
===========================
+ EXIT_VALUE=1
+ set +o xtrace