ResultFAILURE
Tests 0 failed / 0 succeeded
Started2025-03-12 04:56
Elapsed3m57s
Revision4fde5def8559837bcf19ff6c0199f4758092f78f
Refs 908

No Test Failures!


Error lines from build-log.txt

... skipping 74 lines ...
============================
==== RUNNING UNIT TESTS ====
============================
/home/prow/go/src/github.com/tektoncd/results /home/prow/go/src/github.com/tektoncd/results
Using overridden unit_tests
?   	github.com/tektoncd/results/cmd/cli-docs	[no test files]
2025/03/12 04:59:40 maxprocs: Leaving GOMAXPROCS=16: CPU quota undefined
=== RUN   Test_determineAuth
=== RUN   Test_determineAuth/missing_token
=== RUN   Test_determineAuth/invalid_token
=== RUN   Test_determineAuth/valid_token
--- PASS: Test_determineAuth (0.00s)
    --- PASS: Test_determineAuth/missing_token (0.00s)
... skipping 14 lines ...
          []string{
        - 	"a.b",
          	"d.e",
          	"f",
        + 	"a.b",
          }
--- FAIL: TestFieldMask_Paths (0.00s)
=== RUN   TestFieldMask_Filter
--- PASS: TestFieldMask_Filter (0.01s)
=== RUN   TestFieldMask_FilterJSON
--- PASS: TestFieldMask_FilterJSON (0.00s)
=== RUN   TestFromMetadata
--- PASS: TestFromMetadata (0.00s)
=== RUN   TestMetadataAnnotator
--- PASS: TestMetadataAnnotator (0.00s)
FAIL
FAIL	github.com/tektoncd/results/internal/fieldmask	0.045s
=== RUN   TestParseFilter
=== RUN   TestParseFilter/success
=== RUN   TestParseFilter/success/#00
=== RUN   TestParseFilter/success/result
=== RUN   TestParseFilter/success/result.id
=== RUN   TestParseFilter/success/result.id_==_"1"
=== RUN   TestParseFilter/success/result.id_==_"1"_||_result.name_==_"2"
=== RUN   TestParseFilter/success/result.id.startsWith("tacocat")
=== RUN   TestParseFilter/error
=== RUN   TestParseFilter/error/asdf
=== RUN   TestParseFilter/error/result.id_==_1
=== RUN   TestParseFilter/error/result.ID
--- PASS: TestParseFilter (0.04s)
    --- PASS: TestParseFilter/success (0.03s)
        --- PASS: TestParseFilter/success/#00 (0.00s)
        --- PASS: TestParseFilter/success/result (0.01s)
        --- PASS: TestParseFilter/success/result.id (0.00s)
        --- PASS: TestParseFilter/success/result.id_==_"1" (0.00s)
        --- PASS: TestParseFilter/success/result.id_==_"1"_||_result.name_==_"2" (0.00s)
        --- PASS: TestParseFilter/success/result.id.startsWith("tacocat") (0.00s)
    --- PASS: TestParseFilter/error (0.00s)
        --- PASS: TestParseFilter/error/asdf (0.00s)
        --- PASS: TestParseFilter/error/result.id_==_1 (0.00s)
        --- PASS: TestParseFilter/error/result.ID (0.00s)
PASS
ok  	github.com/tektoncd/results/pkg/api/server/cel	1.087s
=== RUN   TestConvertRecordExpressions
=== RUN   TestConvertRecordExpressions/simple_expression
    convert_test.go:170: want: (name = 'foo')
    convert_test.go:171: got:  (name = 'foo')
... skipping 356 lines ...
    db.go:69: /home/prow/go/src/github.com/tektoncd/results/pkg/api/server/v1alpha2/logs.go:352
        [0.930ms] [rows:3] SELECT * FROM `records` WHERE type = "results.tekton.dev/v1alpha3.Log" AND id > "" AND parent = "foo" AND result_name = "bar" ORDER BY created_time LIMIT 51
=== RUN   TestListLogs/unknown_type
=== RUN   TestListLogs/unknown_any_field
=== RUN   TestListLogs/invalid_page_size
=== RUN   TestListLogs/malformed_parent
{"level":"error","ts":1741755625.2509604,"caller":"v1alpha2/logs.go:268","msg":"rpc error: code = InvalidArgument desc = name must match (^[a-z0-9_-]{1,63})/results/([a-z0-9_-]{1,63}$)","stacktrace":"github.com/tektoncd/results/pkg/api/server/v1alpha2.(*Server).ListLogs\n\t/home/prow/go/src/github.com/tektoncd/results/pkg/api/server/v1alpha2/logs.go:268\ngithub.com/tektoncd/results/pkg/api/server/v1alpha2.TestListLogs.func1\n\t/home/prow/go/src/github.com/tektoncd/results/pkg/api/server/v1alpha2/logs_test.go:569\ntesting.tRunner\n\t/usr/local/go/src/testing/testing.go:1690"}
=== RUN   TestListLogs/invalid_order_by_clause
=== RUN   TestListLogs/invalid_sort_direction
--- PASS: TestListLogs (0.80s)
    --- PASS: TestListLogs/all (0.06s)
    --- PASS: TestListLogs/list_all_records_without_knowing_the_result_name (0.07s)
    --- PASS: TestListLogs/list_all_records_without_knowing_the_parent_and_the_result_name (0.06s)
... skipping 171 lines ...
=== RUN   TestCreateRecord/missing_name
=== RUN   TestCreateRecord/result_used_as_name
=== RUN   TestCreateRecord/already_exists
=== NAME  TestCreateRecord
    db.go:69: /home/prow/go/src/github.com/tektoncd/results/pkg/api/server/v1alpha2/records.go:102
        [0.451ms] [rows:1] SELECT `results`.`name`,`results`.`id` FROM `results` WHERE `results`.`parent` = "foo" AND `results`.`name` = "bar" ORDER BY `results`.`id` LIMIT 1
    db.go:69: /home/prow/go/src/github.com/tektoncd/results/pkg/api/server/v1alpha2/records.go:82 UNIQUE constraint failed: records.parent, records.result_name, records.name
        [0.970ms] [rows:0] INSERT INTO `records` (`parent`,`result_id`,`result_name`,`id`,`name`,`type`,`data`,`etag`,`created_time`,`updated_time`) VALUES ("foo","25","bar","27","baz","TaskRun","{""metadata"":{""name"":""tacocat"",""creationTimestamp"":null},""spec"":{""serviceAccountName"":""""},""status"":{""podName"":""""}}","27-1741755627100465618","2025-03-12 05:00:27.1","2025-03-12 05:00:27.1") RETURNING `created_time`,`updated_time`
--- PASS: TestCreateRecord (0.11s)
    --- PASS: TestCreateRecord/success (0.04s)
    --- PASS: TestCreateRecord/mismatched_parent (0.00s)
    --- PASS: TestCreateRecord/parent_does_not_exist (0.00s)
    --- PASS: TestCreateRecord/missing_name (0.00s)
... skipping 13 lines ...
        [0.513ms] [rows:-] SELECT count(*) FROM sqlite_master WHERE type='table' AND name="records"
    db.go:69: /home/prow/go/src/github.com/tektoncd/results/pkg/api/server/v1alpha2/server.go:96
        [20.537ms] [rows:0] CREATE TABLE `records` (`parent` text,`result_id` text,`result_name` text,`id` text,`name` text,`type` text,`data` jsonb,`created_time` datetime DEFAULT current_timestamp,`updated_time` datetime DEFAULT current_timestamp,`etag` text,PRIMARY KEY (`parent`,`result_id`,`id`),CONSTRAINT `fk_records_result` FOREIGN KEY (`parent`,`result_id`) REFERENCES `results`(`parent`,`id`) ON DELETE CASCADE ON UPDATE CASCADE)
    db.go:69: /home/prow/go/src/github.com/tektoncd/results/pkg/api/server/v1alpha2/server.go:96
        [32.205ms] [rows:0] CREATE UNIQUE INDEX `records_by_name` ON `records`(`parent`,`result_name`,`name`)
{"level":"warn","ts":1741755625.953954,"caller":"plugin/plugin_logs.go:429","msg":"Plugin Logs API Disable: unsupported type of logs given for plugin, legacy logging system might work"}
    db.go:69: /home/prow/go/src/github.com/tektoncd/results/pkg/api/server/v1alpha2/records.go:82 FOREIGN KEY constraint failed
        [1.265ms] [rows:0] INSERT INTO `records` (`parent`,`result_id`,`result_name`,`id`,`name`,`type`,`data`,`etag`,`created_time`,`updated_time`) VALUES ("foo","deleted","deleted","28","baz","","","28-1741755627100465618","2025-03-12 05:00:27.1","2025-03-12 05:00:27.1") RETURNING `created_time`,`updated_time`
--- PASS: TestCreateRecord_ConcurrentDelete (0.17s)
=== RUN   TestGetRecord
    records_test.go:185: test database:  /tmp/testdb3542351673
    db.go:69: /home/prow/go/src/github.com/tektoncd/results/pkg/api/server/test/db.go:59
        [0.049ms] [rows:0] PRAGMA foreign_keys = ON;
... skipping 439 lines ...
    db.go:69: /home/prow/go/src/github.com/tektoncd/results/pkg/api/server/v1alpha2/results.go:208
        [0.760ms] [rows:1] SELECT * FROM `results` WHERE `results`.`parent` = "foo" AND `results`.`name` = "bar" ORDER BY `results`.`id` LIMIT 1
=== RUN   TestCreateResult/mismatched_parent
=== RUN   TestCreateResult/missing_name
=== RUN   TestCreateResult/already_exists
=== NAME  TestCreateResult
    db.go:69: /home/prow/go/src/github.com/tektoncd/results/pkg/api/server/v1alpha2/results.go:72 UNIQUE constraint failed: results.parent, results.name
        [0.896ms] [rows:0] INSERT INTO `results` (`parent`,`id`,`name`,`annotations`,`recordsummary_record`,`recordsummary_type`,`recordsummary_start_time`,`recordsummary_end_time`,`recordsummary_status`,`recordsummary_annotations`,`etag`,`created_time`,`updated_time`) VALUES ("foo","40","bar","{""foo"":""bar""}","","",NULL,NULL,0,"null","40-1741755652100465618","2025-03-12 05:00:52.1","2025-03-12 05:00:52.1") RETURNING `created_time`,`updated_time`
=== RUN   TestCreateResult/large_name
=== RUN   TestCreateResult/large_result_summary_type
--- PASS: TestCreateResult (0.08s)
    --- PASS: TestCreateResult/success (0.01s)
    --- PASS: TestCreateResult/mismatched_parent (0.00s)
... skipping 901 lines ...
=== RUN   TestMatch/no_filter
=== RUN   TestMatch/matching_condition
=== RUN   TestMatch/non-matching_condition
=== RUN   TestMatch/nil_result
=== RUN   TestMatch/non-bool_output
=== RUN   TestMatch/wrong_resource_type
2025/03/12 05:00:24 failed to evaluate the expression: no such attribute(s): record
--- PASS: TestMatch (0.05s)
    --- PASS: TestMatch/no_filter (0.00s)
    --- PASS: TestMatch/matching_condition (0.02s)
    --- PASS: TestMatch/non-matching_condition (0.00s)
    --- PASS: TestMatch/nil_result (0.00s)
    --- PASS: TestMatch/non-bool_output (0.00s)
... skipping 391 lines ...
    db.go:69: /home/prow/go/src/github.com/tektoncd/results/pkg/api/server/v1alpha2/records.go:102
        [0.556ms] [rows:1] SELECT `results`.`name`,`results`.`id` FROM `results` WHERE `results`.`parent` = "ns" AND `results`.`name` = "12345" ORDER BY `results`.`id` LIMIT 1
    db.go:69: /home/prow/go/src/github.com/tektoncd/results/pkg/api/server/v1alpha2/records.go:82
        [9.849ms] [rows:1] INSERT INTO `records` (`parent`,`result_id`,`result_name`,`id`,`name`,`type`,`data`,`etag`,`created_time`,`updated_time`) VALUES ("ns","b0bee1e0-0c9d-4f6a-ae1d-c6edcac27282","12345","dc3daad3-113f-46b4-9732-a4e1e75f51af","e73522f6-6f5a-349c-9f9d-13647d108fc9","results.tekton.dev/v1alpha3.Log","{""kind"":""Log"",""apiVersion"":""results.tekton.dev/v1alpha3"",""metadata"":{""name"":""taskrun-log"",""namespace"":""ns"",""uid"":""e73522f6-6f5a-349c-9f9d-13647d108fc9"",""creationTimestamp"":null},""spec"":{""resource"":{""kind"":""TaskRun"",""namespace"":""ns"",""name"":""taskrun"",""uid"":""12345""},""type"":""File""},""status"":{""size"":0,""isStored"":false,""errorOnStoreMsg"":"""",""isRetryableErr"":false}}","dc3daad3-113f-46b4-9732-a4e1e75f51af-1741755647973543133","2025-03-12 05:00:47.973","2025-03-12 05:00:47.973") RETURNING `created_time`,`updated_time`
    logger.go:146: 2025-03-12T05:00:47.988Z	DEBUG	TestReconcile_TaskRun	dynamic/dynamic.go:289	Skipping CRD annotation patch: annotation update is disabled
    logger.go:146: 2025-03-12T05:00:47.988Z	DEBUG	TestReconcile_TaskRun	dynamic/dynamic.go:472	Streaming log started	{"namespace": "ns", "kind": "TaskRun", "name": "taskrun"}
    logger.go:146: 2025-03-12T05:00:47.990Z	ERROR	TestReconcile_TaskRun	dynamic/dynamic.go:480	Error streaming log	{"namespace": "ns", "kind": "TaskRun", "name": "taskrun", "error": "failed to create tkn reader: Parsing kubeconfig failed: invalid configuration: no configuration has been provided, try setting KUBERNETES_MASTER environment variable"}
    logger.go:146: 2025-03-12T05:00:47.990Z	INFO	TestReconcile_TaskRun	dynamic/dynamic.go:488	Streaming log completed	{"namespace": "ns", "kind": "TaskRun", "name": "taskrun"}
    db.go:69: /home/prow/go/src/github.com/tektoncd/results/pkg/api/server/v1alpha2/results.go:208
        [0.807ms] [rows:1] SELECT * FROM `results` WHERE `results`.`parent` = "ns" AND `results`.`name` = "12345" ORDER BY `results`.`id` LIMIT 1
    logger.go:146: 2025-03-12T05:00:47.999Z	DEBUG	TestReconcile_TaskRun	results/results.go:210	No further actions to be done on the Result: no differences found	{"results.tekton.dev/result": "ns/results/12345", "results.tekton.dev/record": "ns/results/12345/records/12345", "results.tekton.dev/top-level-record": true}
    db.go:69: /home/prow/go/src/github.com/tektoncd/results/pkg/api/server/v1alpha2/records.go:135 record not found
        [0.608ms] [rows:0] SELECT * FROM `records` WHERE `records`.`parent` = "ns" AND `records`.`result_name` = "12345" AND `records`.`name` = "8ca2751b-7d03-3f40-8196-05c53c470f0e" ORDER BY `records`.`id` LIMIT 1
... skipping 110 lines ...
    db.go:69: /home/prow/go/src/github.com/tektoncd/results/pkg/api/server/v1alpha2/records.go:135
        [0.703ms] [rows:1] SELECT * FROM `records` WHERE `records`.`parent` = "ns" AND `records`.`result_name` = "12345" AND `records`.`name` = "12345" ORDER BY `records`.`id` LIMIT 1
    logger.go:146: 2025-03-12T05:00:48.306Z	DEBUG	TestReconcile_TaskRun	results/results.go:326	Updating Record	{"results.tekton.dev/record": "ns/results/12345/records/12345"}
    db.go:69: /home/prow/go/src/github.com/tektoncd/results/pkg/api/server/v1alpha2/records.go:135
        [0.646ms] [rows:1] SELECT * FROM `records` WHERE `records`.`parent` = "ns" AND `records`.`result_name` = "12345" AND `records`.`name` = "12345" ORDER BY `records`.`id` LIMIT 1
    db.go:69: /home/prow/go/src/github.com/tektoncd/results/pkg/api/server/v1alpha2/records.go:217
        [0.638ms] [rows:1] UPDATE `records` SET `result_name`="12345",`name`="12345",`type`="tekton.dev/v1.TaskRun",`data`="{""kind"":""TaskRun"",""apiVersion"":""tekton.dev/v1"",""metadata"":{""name"":""taskrun"",""namespace"":""ns"",""uid"":""12345"",""creationTimestamp"":null,""annotations"":{""demo"":""demo""}},""spec"":{""serviceAccountName"":"""",""taskSpec"":{""steps"":[{""name"":"""",""computeResources"":{},""script"":""echo hello world!""}]}},""status"":{""conditions"":[{""type"":""Succeeded"",""status"":""False"",""lastTransitionTime"":""2025-03-12T05:00:48Z"",""reason"":""Failed"",""message"":""Failed""}],""podName"":"""",""startTime"":""2025-03-12T05:00:48Z"",""completionTime"":""2025-03-12T05:00:49Z""}}",`created_time`="2025-03-12 05:00:47.931",`updated_time`="2025-03-12 05:00:48.308",`etag`="1c668593-df6b-4bc8-ae1c-5640e0986d72-1741755648308937266" WHERE `parent` = "ns" AND `result_id` = "b0bee1e0-0c9d-4f6a-ae1d-c6edcac27282" AND `id` = "1c668593-df6b-4bc8-ae1c-5640e0986d72"
    db.go:69: /home/prow/go/src/github.com/tektoncd/results/pkg/api/server/v1alpha2/results.go:208
        [0.682ms] [rows:1] SELECT * FROM `results` WHERE `results`.`parent` = "ns" AND `results`.`name` = "12345" ORDER BY `results`.`id` LIMIT 1
    logger.go:146: 2025-03-12T05:00:48.354Z	DEBUG	TestReconcile_TaskRun	results/results.go:210	No further actions to be done on the Result: no differences found	{"results.tekton.dev/result": "ns/results/12345", "results.tekton.dev/record": "ns/results/12345/records/12345", "results.tekton.dev/top-level-record": true}
    db.go:69: /home/prow/go/src/github.com/tektoncd/results/pkg/api/server/v1alpha2/records.go:135
        [0.681ms] [rows:1] SELECT * FROM `records` WHERE `records`.`parent` = "ns" AND `records`.`result_name` = "12345" AND `records`.`name` = "e73522f6-6f5a-349c-9f9d-13647d108fc9" ORDER BY `records`.`id` LIMIT 1
    db.go:69: /home/prow/go/src/github.com/tektoncd/results/pkg/api/server/v1alpha2/results.go:208
... skipping 34 lines ...
    db.go:69: /home/prow/go/src/github.com/tektoncd/results/pkg/api/server/v1alpha2/records.go:135
        [0.643ms] [rows:1] SELECT * FROM `records` WHERE `records`.`parent` = "ns" AND `records`.`result_name` = "12345" AND `records`.`name` = "12345" ORDER BY `records`.`id` LIMIT 1
    logger.go:146: 2025-03-12T05:00:48.450Z	DEBUG	TestReconcile_TaskRun	results/results.go:326	Updating Record	{"results.tekton.dev/record": "ns/results/12345/records/12345"}
    db.go:69: /home/prow/go/src/github.com/tektoncd/results/pkg/api/server/v1alpha2/records.go:135
        [0.650ms] [rows:1] SELECT * FROM `records` WHERE `records`.`parent` = "ns" AND `records`.`result_name` = "12345" AND `records`.`name` = "12345" ORDER BY `records`.`id` LIMIT 1
    db.go:69: /home/prow/go/src/github.com/tektoncd/results/pkg/api/server/v1alpha2/records.go:217
        [1.353ms] [rows:1] UPDATE `records` SET `result_name`="12345",`name`="12345",`type`="tekton.dev/v1.TaskRun",`data`="{""kind"":""TaskRun"",""apiVersion"":""tekton.dev/v1"",""metadata"":{""name"":""taskrun"",""namespace"":""ns"",""uid"":""12345"",""creationTimestamp"":null,""labels"":{""x"":""foo""},""annotations"":{""demo"":""demo""}},""spec"":{""serviceAccountName"":"""",""taskSpec"":{""steps"":[{""name"":"""",""computeResources"":{},""script"":""echo hello world!""}]}},""status"":{""conditions"":[{""type"":""Succeeded"",""status"":""False"",""lastTransitionTime"":""2025-03-12T05:00:48Z"",""reason"":""Failed"",""message"":""Failed""}],""podName"":"""",""startTime"":""2025-03-12T05:00:48Z"",""completionTime"":""2025-03-12T05:00:49Z""}}",`created_time`="2025-03-12 05:00:47.931",`updated_time`="2025-03-12 05:00:48.452",`etag`="1c668593-df6b-4bc8-ae1c-5640e0986d72-1741755648452812095" WHERE `parent` = "ns" AND `result_id` = "b0bee1e0-0c9d-4f6a-ae1d-c6edcac27282" AND `id` = "1c668593-df6b-4bc8-ae1c-5640e0986d72"
    db.go:69: /home/prow/go/src/github.com/tektoncd/results/pkg/api/server/v1alpha2/results.go:208
        [0.697ms] [rows:1] SELECT * FROM `results` WHERE `results`.`parent` = "ns" AND `results`.`name` = "12345" ORDER BY `results`.`id` LIMIT 1
    logger.go:146: 2025-03-12T05:00:48.467Z	DEBUG	TestReconcile_TaskRun	results/results.go:210	No further actions to be done on the Result: no differences found	{"results.tekton.dev/result": "ns/results/12345", "results.tekton.dev/record": "ns/results/12345/records/12345", "results.tekton.dev/top-level-record": true}
    db.go:69: /home/prow/go/src/github.com/tektoncd/results/pkg/api/server/v1alpha2/records.go:135
        [0.867ms] [rows:1] SELECT * FROM `records` WHERE `records`.`parent` = "ns" AND `records`.`result_name` = "12345" AND `records`.`name` = "e73522f6-6f5a-349c-9f9d-13647d108fc9" ORDER BY `records`.`id` LIMIT 1
    db.go:69: /home/prow/go/src/github.com/tektoncd/results/pkg/api/server/v1alpha2/results.go:208
... skipping 52 lines ...
    db.go:69: /home/prow/go/src/github.com/tektoncd/results/pkg/api/server/v1alpha2/records.go:135
        [0.633ms] [rows:1] SELECT * FROM `records` WHERE `records`.`parent` = "ns" AND `records`.`result_name` = "12345" AND `records`.`name` = "12345" ORDER BY `records`.`id` LIMIT 1
    logger.go:146: 2025-03-12T05:00:48.630Z	DEBUG	TestReconcile_TaskRun	results/results.go:326	Updating Record	{"results.tekton.dev/record": "ns/results/12345/records/12345"}
    db.go:69: /home/prow/go/src/github.com/tektoncd/results/pkg/api/server/v1alpha2/records.go:135
        [0.578ms] [rows:1] SELECT * FROM `records` WHERE `records`.`parent` = "ns" AND `records`.`result_name` = "12345" AND `records`.`name` = "12345" ORDER BY `records`.`id` LIMIT 1
    db.go:69: /home/prow/go/src/github.com/tektoncd/results/pkg/api/server/v1alpha2/records.go:217
        [1.295ms] [rows:1] UPDATE `records` SET `result_name`="12345",`name`="12345",`type`="tekton.dev/v1.TaskRun",`data`="{""kind"":""TaskRun"",""apiVersion"":""tekton.dev/v1"",""metadata"":{""name"":""taskrun"",""namespace"":""ns"",""uid"":""12345"",""creationTimestamp"":null,""labels"":{""x"":""foo""},""annotations"":{""x"":""foo""}},""spec"":{""serviceAccountName"":"""",""taskSpec"":{""steps"":[{""name"":"""",""computeResources"":{},""script"":""echo hello world!""}]}},""status"":{""conditions"":[{""type"":""Succeeded"",""status"":""False"",""lastTransitionTime"":""2025-03-12T05:00:48Z"",""reason"":""Failed"",""message"":""Failed""}],""podName"":"""",""startTime"":""2025-03-12T05:00:48Z"",""completionTime"":""2025-03-12T05:00:49Z""}}",`created_time`="2025-03-12 05:00:47.931",`updated_time`="2025-03-12 05:00:48.633",`etag`="1c668593-df6b-4bc8-ae1c-5640e0986d72-1741755648633153786" WHERE `parent` = "ns" AND `result_id` = "b0bee1e0-0c9d-4f6a-ae1d-c6edcac27282" AND `id` = "1c668593-df6b-4bc8-ae1c-5640e0986d72"
    db.go:69: /home/prow/go/src/github.com/tektoncd/results/pkg/api/server/v1alpha2/results.go:208
        [0.651ms] [rows:1] SELECT * FROM `results` WHERE `results`.`parent` = "ns" AND `results`.`name` = "12345" ORDER BY `results`.`id` LIMIT 1
    logger.go:146: 2025-03-12T05:00:48.654Z	DEBUG	TestReconcile_TaskRun	results/results.go:210	No further actions to be done on the Result: no differences found	{"results.tekton.dev/result": "ns/results/12345", "results.tekton.dev/record": "ns/results/12345/records/12345", "results.tekton.dev/top-level-record": true}
    db.go:69: /home/prow/go/src/github.com/tektoncd/results/pkg/api/server/v1alpha2/records.go:135
        [0.688ms] [rows:1] SELECT * FROM `records` WHERE `records`.`parent` = "ns" AND `records`.`result_name` = "12345" AND `records`.`name` = "e73522f6-6f5a-349c-9f9d-13647d108fc9" ORDER BY `records`.`id` LIMIT 1
    db.go:69: /home/prow/go/src/github.com/tektoncd/results/pkg/api/server/v1alpha2/results.go:208
... skipping 14 lines ...
    db.go:69: /home/prow/go/src/github.com/tektoncd/results/pkg/api/server/v1alpha2/records.go:135
        [0.634ms] [rows:1] SELECT * FROM `records` WHERE `records`.`parent` = "ns" AND `records`.`result_name` = "12345" AND `records`.`name` = "12345" ORDER BY `records`.`id` LIMIT 1
    logger.go:146: 2025-03-12T05:00:48.703Z	DEBUG	TestReconcile_TaskRun	results/results.go:326	Updating Record	{"results.tekton.dev/record": "ns/results/12345/records/12345"}
    db.go:69: /home/prow/go/src/github.com/tektoncd/results/pkg/api/server/v1alpha2/records.go:135
        [0.569ms] [rows:1] SELECT * FROM `records` WHERE `records`.`parent` = "ns" AND `records`.`result_name` = "12345" AND `records`.`name` = "12345" ORDER BY `records`.`id` LIMIT 1
    db.go:69: /home/prow/go/src/github.com/tektoncd/results/pkg/api/server/v1alpha2/records.go:217
        [0.630ms] [rows:1] UPDATE `records` SET `result_name`="12345",`name`="12345",`type`="tekton.dev/v1.TaskRun",`data`="{""kind"":""TaskRun"",""apiVersion"":""tekton.dev/v1"",""metadata"":{""name"":""taskrun"",""namespace"":""ns"",""uid"":""12345"",""creationTimestamp"":null,""labels"":{""x"":""foo""},""annotations"":{""x"":""foo""},""ownerReferences"":[{""apiVersion"":""v1"",""kind"":""test"",""name"":""test-owner"",""uid"":""""}]},""spec"":{""serviceAccountName"":"""",""taskSpec"":{""steps"":[{""name"":"""",""computeResources"":{},""script"":""echo hello world!""}]}},""status"":{""conditions"":[{""type"":""Succeeded"",""status"":""False"",""lastTransitionTime"":""2025-03-12T05:00:48Z"",""reason"":""Failed"",""message"":""Failed""}],""podName"":"""",""startTime"":""2025-03-12T05:00:48Z"",""completionTime"":""2025-03-12T05:00:49Z""}}",`created_time`="2025-03-12 05:00:47.931",`updated_time`="2025-03-12 05:00:48.706",`etag`="1c668593-df6b-4bc8-ae1c-5640e0986d72-1741755648706712212" WHERE `parent` = "ns" AND `result_id` = "b0bee1e0-0c9d-4f6a-ae1d-c6edcac27282" AND `id` = "1c668593-df6b-4bc8-ae1c-5640e0986d72"
    db.go:69: /home/prow/go/src/github.com/tektoncd/results/pkg/api/server/v1alpha2/results.go:208
        [0.728ms] [rows:1] SELECT * FROM `results` WHERE `results`.`parent` = "ns" AND `results`.`name` = "12345" ORDER BY `results`.`id` LIMIT 1
    logger.go:146: 2025-03-12T05:00:48.722Z	DEBUG	TestReconcile_TaskRun	results/results.go:202	No further actions to be done on the Result: the object is not a top level record	{"results.tekton.dev/result": "ns/results/12345", "results.tekton.dev/record": "ns/results/12345/records/12345", "results.tekton.dev/top-level-record": false}
    db.go:69: /home/prow/go/src/github.com/tektoncd/results/pkg/api/server/v1alpha2/records.go:135
        [0.627ms] [rows:1] SELECT * FROM `records` WHERE `records`.`parent` = "ns" AND `records`.`result_name` = "12345" AND `records`.`name` = "e73522f6-6f5a-349c-9f9d-13647d108fc9" ORDER BY `records`.`id` LIMIT 1
    db.go:69: /home/prow/go/src/github.com/tektoncd/results/pkg/api/server/v1alpha2/results.go:208
... skipping 16 lines ...
    db.go:69: /home/prow/go/src/github.com/tektoncd/results/pkg/api/server/v1alpha2/records.go:135 record not found
        [0.480ms] [rows:0] SELECT * FROM `records` WHERE `records`.`parent` = "ns" AND `records`.`result_name` = "61b6109d-9af9-4321-b8be-9a01a6d75a27" AND `records`.`name` = "12345" ORDER BY `records`.`id` LIMIT 1
    logger.go:146: 2025-03-12T05:00:48.796Z	DEBUG	TestReconcile_TaskRun	results/results.go:334	Record doesn't exist yet - creating	{"results.tekton.dev/record": "ns/results/61b6109d-9af9-4321-b8be-9a01a6d75a27/records/12345"}
    db.go:69: /home/prow/go/src/github.com/tektoncd/results/pkg/api/server/v1alpha2/records.go:102
        [0.399ms] [rows:1] SELECT `results`.`name`,`results`.`id` FROM `results` WHERE `results`.`parent` = "ns" AND `results`.`name` = "61b6109d-9af9-4321-b8be-9a01a6d75a27" ORDER BY `results`.`id` LIMIT 1
    db.go:69: /home/prow/go/src/github.com/tektoncd/results/pkg/api/server/v1alpha2/records.go:82
        [13.851ms] [rows:1] INSERT INTO `records` (`parent`,`result_id`,`result_name`,`id`,`name`,`type`,`data`,`etag`,`created_time`,`updated_time`) VALUES ("ns","bb90432e-36bb-4203-80dc-1c70c20f0e49","61b6109d-9af9-4321-b8be-9a01a6d75a27","ed0944aa-4b4b-48a4-84f8-01746bef1018","12345","tekton.dev/v1.TaskRun","{""kind"":""TaskRun"",""apiVersion"":""tekton.dev/v1"",""metadata"":{""name"":""taskrun"",""namespace"":""ns"",""uid"":""12345"",""creationTimestamp"":null,""labels"":{""x"":""foo""},""annotations"":{""x"":""foo""},""ownerReferences"":[{""apiVersion"":""tekton.dev/v1"",""kind"":""PipelineRun"",""name"":""test-pipelinerun"",""uid"":""61b6109d-9af9-4321-b8be-9a01a6d75a27""}]},""spec"":{""serviceAccountName"":"""",""taskSpec"":{""steps"":[{""name"":"""",""computeResources"":{},""script"":""echo hello world!""}]}},""status"":{""conditions"":[{""type"":""Succeeded"",""status"":""False"",""lastTransitionTime"":""2025-03-12T05:00:48Z"",""reason"":""Failed"",""message"":""Failed""}],""podName"":"""",""startTime"":""2025-03-12T05:00:48Z"",""completionTime"":""2025-03-12T05:00:49Z""}}","ed0944aa-4b4b-48a4-84f8-01746bef1018-1741755648798455709","2025-03-12 05:00:48.798","2025-03-12 05:00:48.798") RETURNING `created_time`,`updated_time`
    db.go:69: /home/prow/go/src/github.com/tektoncd/results/pkg/api/server/v1alpha2/results.go:208
        [0.745ms] [rows:1] SELECT * FROM `results` WHERE `results`.`parent` = "ns" AND `results`.`name` = "61b6109d-9af9-4321-b8be-9a01a6d75a27" ORDER BY `results`.`id` LIMIT 1
    logger.go:146: 2025-03-12T05:00:48.821Z	DEBUG	TestReconcile_TaskRun	results/results.go:202	No further actions to be done on the Result: the object is not a top level record	{"results.tekton.dev/result": "ns/results/61b6109d-9af9-4321-b8be-9a01a6d75a27", "results.tekton.dev/record": "ns/results/61b6109d-9af9-4321-b8be-9a01a6d75a27/records/12345", "results.tekton.dev/top-level-record": false}
    db.go:69: /home/prow/go/src/github.com/tektoncd/results/pkg/api/server/v1alpha2/records.go:135 record not found
        [0.505ms] [rows:0] SELECT * FROM `records` WHERE `records`.`parent` = "ns" AND `records`.`result_name` = "61b6109d-9af9-4321-b8be-9a01a6d75a27" AND `records`.`name` = "c1c57873-4d7f-3bd9-bfd3-d89d475630f0" ORDER BY `records`.`id` LIMIT 1
    db.go:69: /home/prow/go/src/github.com/tektoncd/results/pkg/api/server/v1alpha2/results.go:208
... skipping 3 lines ...
        [0.441ms] [rows:0] SELECT * FROM `records` WHERE `records`.`parent` = "ns" AND `records`.`result_name` = "61b6109d-9af9-4321-b8be-9a01a6d75a27" AND `records`.`name` = "c1c57873-4d7f-3bd9-bfd3-d89d475630f0" ORDER BY `records`.`id` LIMIT 1
    db.go:69: /home/prow/go/src/github.com/tektoncd/results/pkg/api/server/v1alpha2/records.go:102
        [0.484ms] [rows:1] SELECT `results`.`name`,`results`.`id` FROM `results` WHERE `results`.`parent` = "ns" AND `results`.`name` = "61b6109d-9af9-4321-b8be-9a01a6d75a27" ORDER BY `results`.`id` LIMIT 1
    db.go:69: /home/prow/go/src/github.com/tektoncd/results/pkg/api/server/v1alpha2/records.go:82
        [11.186ms] [rows:1] INSERT INTO `records` (`parent`,`result_id`,`result_name`,`id`,`name`,`type`,`data`,`etag`,`created_time`,`updated_time`) VALUES ("ns","bb90432e-36bb-4203-80dc-1c70c20f0e49","61b6109d-9af9-4321-b8be-9a01a6d75a27","cd983d2f-262d-43f5-a167-098b1874c3bb","c1c57873-4d7f-3bd9-bfd3-d89d475630f0","results.tekton.dev/v1alpha3.Log","{""kind"":""Log"",""apiVersion"":""results.tekton.dev/v1alpha3"",""metadata"":{""name"":""taskrun-log"",""namespace"":""ns"",""uid"":""c1c57873-4d7f-3bd9-bfd3-d89d475630f0"",""creationTimestamp"":null},""spec"":{""resource"":{""kind"":""TaskRun"",""namespace"":""ns"",""name"":""taskrun"",""uid"":""12345""},""type"":""File""},""status"":{""size"":0,""isStored"":false,""errorOnStoreMsg"":"""",""isRetryableErr"":false}}","cd983d2f-262d-43f5-a167-098b1874c3bb-1741755648830806932","2025-03-12 05:00:48.83","2025-03-12 05:00:48.83") RETURNING `created_time`,`updated_time`
    logger.go:146: 2025-03-12T05:00:48.846Z	DEBUG	TestReconcile_TaskRun	dynamic/dynamic.go:472	Streaming log started	{"namespace": "ns", "kind": "TaskRun", "name": "taskrun"}
    logger.go:146: 2025-03-12T05:00:48.847Z	ERROR	TestReconcile_TaskRun	dynamic/dynamic.go:480	Error streaming log	{"namespace": "ns", "kind": "TaskRun", "name": "taskrun", "error": "failed to create tkn reader: Parsing kubeconfig failed: invalid configuration: no configuration has been provided, try setting KUBERNETES_MASTER environment variable"}
    logger.go:146: 2025-03-12T05:00:48.847Z	INFO	TestReconcile_TaskRun	dynamic/dynamic.go:488	Streaming log completed	{"namespace": "ns", "kind": "TaskRun", "name": "taskrun"}
    db.go:69: /home/prow/go/src/github.com/tektoncd/results/pkg/api/server/v1alpha2/results.go:208
        [0.714ms] [rows:1] SELECT * FROM `results` WHERE `results`.`parent` = "ns" AND `results`.`name` = "61b6109d-9af9-4321-b8be-9a01a6d75a27" ORDER BY `results`.`id` LIMIT 1
    logger.go:146: 2025-03-12T05:00:48.850Z	DEBUG	TestReconcile_TaskRun	results/results.go:202	No further actions to be done on the Result: the object is not a top level record	{"results.tekton.dev/result": "ns/results/61b6109d-9af9-4321-b8be-9a01a6d75a27", "results.tekton.dev/record": "ns/results/61b6109d-9af9-4321-b8be-9a01a6d75a27/records/12345", "results.tekton.dev/top-level-record": false}
    db.go:69: /home/prow/go/src/github.com/tektoncd/results/pkg/api/server/v1alpha2/records.go:135 record not found
        [0.385ms] [rows:0] SELECT * FROM `records` WHERE `records`.`parent` = "ns" AND `records`.`result_name` = "61b6109d-9af9-4321-b8be-9a01a6d75a27" AND `records`.`name` = "eddc3f2d-56e8-3e1c-9312-136befa388d3" ORDER BY `records`.`id` LIMIT 1
... skipping 18 lines ...
    db.go:69: /home/prow/go/src/github.com/tektoncd/results/pkg/api/server/v1alpha2/records.go:135
        [0.636ms] [rows:1] SELECT * FROM `records` WHERE `records`.`parent` = "ns" AND `records`.`result_name` = "12345" AND `records`.`name` = "12345" ORDER BY `records`.`id` LIMIT 1
    logger.go:146: 2025-03-12T05:00:48.901Z	DEBUG	TestReconcile_TaskRun	results/results.go:326	Updating Record	{"results.tekton.dev/record": "ns/results/12345/records/12345"}
    db.go:69: /home/prow/go/src/github.com/tektoncd/results/pkg/api/server/v1alpha2/records.go:135
        [0.535ms] [rows:1] SELECT * FROM `records` WHERE `records`.`parent` = "ns" AND `records`.`result_name` = "12345" AND `records`.`name` = "12345" ORDER BY `records`.`id` LIMIT 1
    db.go:69: /home/prow/go/src/github.com/tektoncd/results/pkg/api/server/v1alpha2/records.go:217
        [0.642ms] [rows:1] UPDATE `records` SET `result_name`="12345",`name`="12345",`type`="tekton.dev/v1.TaskRun",`data`="{""kind"":""TaskRun"",""apiVersion"":""tekton.dev/v1"",""metadata"":{""name"":""taskrun"",""namespace"":""ns"",""uid"":""12345"",""creationTimestamp"":null,""labels"":{""x"":""foo""},""annotations"":{""x"":""foo""},""ownerReferences"":[{""apiVersion"":""v1"",""kind"":""test"",""name"":""test-owner"",""uid"":""e6879750-7e8c-4723-a30f-7829c9ea8e8f""}]},""spec"":{""serviceAccountName"":"""",""taskSpec"":{""steps"":[{""name"":"""",""computeResources"":{},""script"":""echo hello world!""}]}},""status"":{""conditions"":[{""type"":""Succeeded"",""status"":""False"",""lastTransitionTime"":""2025-03-12T05:00:48Z"",""reason"":""Failed"",""message"":""Failed""}],""podName"":"""",""startTime"":""2025-03-12T05:00:48Z"",""completionTime"":""2025-03-12T05:00:49Z""}}",`created_time`="2025-03-12 05:00:47.931",`updated_time`="2025-03-12 05:00:48.904",`etag`="1c668593-df6b-4bc8-ae1c-5640e0986d72-1741755648904346080" WHERE `parent` = "ns" AND `result_id` = "b0bee1e0-0c9d-4f6a-ae1d-c6edcac27282" AND `id` = "1c668593-df6b-4bc8-ae1c-5640e0986d72"
    db.go:69: /home/prow/go/src/github.com/tektoncd/results/pkg/api/server/v1alpha2/results.go:208
        [0.702ms] [rows:1] SELECT * FROM `results` WHERE `results`.`parent` = "ns" AND `results`.`name` = "12345" ORDER BY `results`.`id` LIMIT 1
    logger.go:146: 2025-03-12T05:00:48.913Z	DEBUG	TestReconcile_TaskRun	results/results.go:202	No further actions to be done on the Result: the object is not a top level record	{"results.tekton.dev/result": "ns/results/12345", "results.tekton.dev/record": "ns/results/12345/records/12345", "results.tekton.dev/top-level-record": false}
    db.go:69: /home/prow/go/src/github.com/tektoncd/results/pkg/api/server/v1alpha2/records.go:135
        [0.666ms] [rows:1] SELECT * FROM `records` WHERE `records`.`parent` = "ns" AND `records`.`result_name` = "12345" AND `records`.`name` = "e73522f6-6f5a-349c-9f9d-13647d108fc9" ORDER BY `records`.`id` LIMIT 1
    db.go:69: /home/prow/go/src/github.com/tektoncd/results/pkg/api/server/v1alpha2/results.go:208
... skipping 57 lines ...
        [0.463ms] [rows:0] SELECT * FROM `records` WHERE `records`.`parent` = "ns" AND `records`.`result_name` = "12345" AND `records`.`name` = "0776aaa7-1fcd-304c-9a53-3ce0111f6f49" ORDER BY `records`.`id` LIMIT 1
    db.go:69: /home/prow/go/src/github.com/tektoncd/results/pkg/api/server/v1alpha2/records.go:102
        [0.474ms] [rows:1] SELECT `results`.`name`,`results`.`id` FROM `results` WHERE `results`.`parent` = "ns" AND `results`.`name` = "12345" ORDER BY `results`.`id` LIMIT 1
    db.go:69: /home/prow/go/src/github.com/tektoncd/results/pkg/api/server/v1alpha2/records.go:82
        [6.391ms] [rows:1] INSERT INTO `records` (`parent`,`result_id`,`result_name`,`id`,`name`,`type`,`data`,`etag`,`created_time`,`updated_time`) VALUES ("ns","fcd3a5e9-9f76-424d-8466-4402f39b13cd","12345","48daa49a-0462-424b-ad50-77636b819021","0776aaa7-1fcd-304c-9a53-3ce0111f6f49","results.tekton.dev/v1alpha3.Log","{""kind"":""Log"",""apiVersion"":""results.tekton.dev/v1alpha3"",""metadata"":{""name"":""pipelinerun-log"",""namespace"":""ns"",""uid"":""0776aaa7-1fcd-304c-9a53-3ce0111f6f49"",""creationTimestamp"":null},""spec"":{""resource"":{""kind"":""PipelineRun"",""namespace"":""ns"",""name"":""pipelinerun"",""uid"":""12345""},""type"":""File""},""status"":{""size"":0,""isStored"":false,""errorOnStoreMsg"":"""",""isRetryableErr"":false}}","48daa49a-0462-424b-ad50-77636b819021-1741755649082364689","2025-03-12 05:00:49.082","2025-03-12 05:00:49.082") RETURNING `created_time`,`updated_time`
    logger.go:146: 2025-03-12T05:00:49.094Z	DEBUG	TestReconcile_PipelineRun	dynamic/dynamic.go:472	Streaming log started	{"namespace": "ns", "kind": "PipelineRun", "name": "pipelinerun"}
    logger.go:146: 2025-03-12T05:00:49.095Z	ERROR	TestReconcile_PipelineRun	dynamic/dynamic.go:480	Error streaming log	{"namespace": "ns", "kind": "PipelineRun", "name": "pipelinerun", "error": "failed to create tkn reader: Parsing kubeconfig failed: invalid configuration: no configuration has been provided, try setting KUBERNETES_MASTER environment variable"}
    logger.go:146: 2025-03-12T05:00:49.095Z	INFO	TestReconcile_PipelineRun	dynamic/dynamic.go:488	Streaming log completed	{"namespace": "ns", "kind": "PipelineRun", "name": "pipelinerun"}
    db.go:69: /home/prow/go/src/github.com/tektoncd/results/pkg/api/server/v1alpha2/results.go:208
        [0.727ms] [rows:1] SELECT * FROM `results` WHERE `results`.`parent` = "ns" AND `results`.`name` = "12345" ORDER BY `results`.`id` LIMIT 1
    logger.go:146: 2025-03-12T05:00:49.099Z	DEBUG	TestReconcile_PipelineRun	results/results.go:210	No further actions to be done on the Result: no differences found	{"results.tekton.dev/result": "ns/results/12345", "results.tekton.dev/record": "ns/results/12345/records/12345", "results.tekton.dev/top-level-record": true}
    db.go:69: /home/prow/go/src/github.com/tektoncd/results/pkg/api/server/v1alpha2/records.go:135 record not found
        [0.588ms] [rows:0] SELECT * FROM `records` WHERE `records`.`parent` = "ns" AND `records`.`result_name` = "12345" AND `records`.`name` = "f46dbc65-8a66-37f4-a5cf-d479290cf7bc" ORDER BY `records`.`id` LIMIT 1
... skipping 399 lines ...
        --- PASS: TestPut/pipelinerun/update (0.01s)
PASS
ok  	github.com/tektoncd/results/pkg/watcher/results	2.713s
testing: warning: no tests to run
PASS
ok  	github.com/tektoncd/results/tools/postgres-migrate	1.171s [no tests to run]
FAIL
unit_tests returning 
===========================
==== UNIT TESTS FAILED ====
===========================
+ EXIT_VALUE=1
+ set +o xtrace