ResultFAILURE
Tests 0 failed / 0 succeeded
Started2025-02-20 20:58
Elapsed3m14s
Revisioneaeaa8c769455449682aaad6d84e22682efbed57
Refs 963

No Test Failures!


Error lines from build-log.txt

... skipping 60 lines ...
============================
==== RUNNING UNIT TESTS ====
============================
/home/prow/go/src/github.com/tektoncd/results /home/prow/go/src/github.com/tektoncd/results
Using overridden unit_tests
?   	github.com/tektoncd/results/cmd/cli-docs	[no test files]
2025/02/20 21:00:35 maxprocs: Leaving GOMAXPROCS=16: CPU quota undefined
=== RUN   Test_determineAuth
=== RUN   Test_determineAuth/missing_token
=== RUN   Test_determineAuth/invalid_token
=== RUN   Test_determineAuth/valid_token
--- PASS: Test_determineAuth (0.00s)
    --- PASS: Test_determineAuth/missing_token (0.00s)
... skipping 14 lines ...
          []string{
        - 	"a.b",
          	"d.e",
          	"f",
        + 	"a.b",
          }
--- FAIL: TestFieldMask_Paths (0.00s)
=== RUN   TestFieldMask_Filter
--- PASS: TestFieldMask_Filter (0.01s)
=== RUN   TestFieldMask_FilterJSON
--- PASS: TestFieldMask_FilterJSON (0.00s)
=== RUN   TestFromMetadata
--- PASS: TestFromMetadata (0.00s)
=== RUN   TestMetadataAnnotator
--- PASS: TestMetadataAnnotator (0.00s)
FAIL
FAIL	github.com/tektoncd/results/internal/fieldmask	0.043s
=== RUN   TestParseFilter
=== RUN   TestParseFilter/success
=== RUN   TestParseFilter/success/#00
=== RUN   TestParseFilter/success/result
=== RUN   TestParseFilter/success/result.id
=== RUN   TestParseFilter/success/result.id_==_"1"
=== RUN   TestParseFilter/success/result.id_==_"1"_||_result.name_==_"2"
=== RUN   TestParseFilter/success/result.id.startsWith("tacocat")
=== RUN   TestParseFilter/error
=== RUN   TestParseFilter/error/asdf
=== RUN   TestParseFilter/error/result.id_==_1
=== RUN   TestParseFilter/error/result.ID
--- PASS: TestParseFilter (0.04s)
    --- PASS: TestParseFilter/success (0.02s)
        --- PASS: TestParseFilter/success/#00 (0.00s)
        --- PASS: TestParseFilter/success/result (0.01s)
        --- PASS: TestParseFilter/success/result.id (0.00s)
        --- PASS: TestParseFilter/success/result.id_==_"1" (0.00s)
        --- PASS: TestParseFilter/success/result.id_==_"1"_||_result.name_==_"2" (0.00s)
        --- PASS: TestParseFilter/success/result.id.startsWith("tacocat") (0.01s)
    --- PASS: TestParseFilter/error (0.00s)
        --- PASS: TestParseFilter/error/asdf (0.00s)
        --- PASS: TestParseFilter/error/result.id_==_1 (0.00s)
        --- PASS: TestParseFilter/error/result.ID (0.00s)
PASS
ok  	github.com/tektoncd/results/pkg/api/server/cel	1.083s
=== RUN   TestConvertRecordExpressions
=== RUN   TestConvertRecordExpressions/simple_expression
    convert_test.go:170: want: (name = 'foo')
    convert_test.go:171: got:  (name = 'foo')
... skipping 356 lines ...
    db.go:69: /home/prow/go/src/github.com/tektoncd/results/pkg/api/server/v1alpha2/logs.go:352
        [0.715ms] [rows:3] SELECT * FROM `records` WHERE type = "results.tekton.dev/v1alpha3.Log" AND id > "" AND parent = "foo" AND result_name = "bar" ORDER BY created_time LIMIT 51
=== RUN   TestListLogs/unknown_type
=== RUN   TestListLogs/unknown_any_field
=== RUN   TestListLogs/invalid_page_size
=== RUN   TestListLogs/malformed_parent
{"level":"error","ts":1740085269.3120515,"caller":"v1alpha2/logs.go:268","msg":"rpc error: code = InvalidArgument desc = name must match (^[a-z0-9_-]{1,63})/results/([a-z0-9_-]{1,63}$)","stacktrace":"github.com/tektoncd/results/pkg/api/server/v1alpha2.(*Server).ListLogs\n\t/home/prow/go/src/github.com/tektoncd/results/pkg/api/server/v1alpha2/logs.go:268\ngithub.com/tektoncd/results/pkg/api/server/v1alpha2.TestListLogs.func1\n\t/home/prow/go/src/github.com/tektoncd/results/pkg/api/server/v1alpha2/logs_test.go:569\ntesting.tRunner\n\t/usr/local/go/src/testing/testing.go:1690"}
=== RUN   TestListLogs/invalid_order_by_clause
=== RUN   TestListLogs/invalid_sort_direction
--- PASS: TestListLogs (0.55s)
    --- PASS: TestListLogs/all (0.04s)
    --- PASS: TestListLogs/list_all_records_without_knowing_the_result_name (0.03s)
    --- PASS: TestListLogs/list_all_records_without_knowing_the_parent_and_the_result_name (0.03s)
... skipping 171 lines ...
=== RUN   TestCreateRecord/missing_name
=== RUN   TestCreateRecord/result_used_as_name
=== RUN   TestCreateRecord/already_exists
=== NAME  TestCreateRecord
    db.go:69: /home/prow/go/src/github.com/tektoncd/results/pkg/api/server/v1alpha2/records.go:102
        [0.276ms] [rows:1] SELECT `results`.`name`,`results`.`id` FROM `results` WHERE `results`.`parent` = "foo" AND `results`.`name` = "bar" ORDER BY `results`.`id` LIMIT 1
    db.go:69: /home/prow/go/src/github.com/tektoncd/results/pkg/api/server/v1alpha2/records.go:82 UNIQUE constraint failed: records.parent, records.result_name, records.name
        [0.621ms] [rows:0] INSERT INTO `records` (`parent`,`result_id`,`result_name`,`id`,`name`,`type`,`data`,`etag`,`created_time`,`updated_time`) VALUES ("foo","25","bar","27","baz","TaskRun","{""metadata"":{""name"":""tacocat"",""creationTimestamp"":null},""spec"":{""serviceAccountName"":""""},""status"":{""podName"":""""}}","27-1740085271539878966","2025-02-20 21:01:11.539","2025-02-20 21:01:11.539") RETURNING `created_time`,`updated_time`
--- PASS: TestCreateRecord (0.09s)
    --- PASS: TestCreateRecord/success (0.02s)
    --- PASS: TestCreateRecord/mismatched_parent (0.00s)
    --- PASS: TestCreateRecord/parent_does_not_exist (0.00s)
    --- PASS: TestCreateRecord/missing_name (0.00s)
... skipping 13 lines ...
        [0.131ms] [rows:-] SELECT count(*) FROM sqlite_master WHERE type='table' AND name="records"
    db.go:69: /home/prow/go/src/github.com/tektoncd/results/pkg/api/server/v1alpha2/server.go:96
        [19.491ms] [rows:0] CREATE TABLE `records` (`parent` text,`result_id` text,`result_name` text,`id` text,`name` text,`type` text,`data` jsonb,`created_time` datetime DEFAULT current_timestamp,`updated_time` datetime DEFAULT current_timestamp,`etag` text,PRIMARY KEY (`parent`,`result_id`,`id`),CONSTRAINT `fk_records_result` FOREIGN KEY (`parent`,`result_id`) REFERENCES `results`(`parent`,`id`) ON DELETE CASCADE ON UPDATE CASCADE)
    db.go:69: /home/prow/go/src/github.com/tektoncd/results/pkg/api/server/v1alpha2/server.go:96
        [15.573ms] [rows:0] CREATE UNIQUE INDEX `records_by_name` ON `records`(`parent`,`result_name`,`name`)
{"level":"warn","ts":1740085270.912814,"caller":"plugin/plugin_logs.go:428","msg":"Plugin Logs API Disable: unsupported type of logs given for plugin, legacy logging system might work"}
    db.go:69: /home/prow/go/src/github.com/tektoncd/results/pkg/api/server/v1alpha2/records.go:82 FOREIGN KEY constraint failed
        [1.187ms] [rows:0] INSERT INTO `records` (`parent`,`result_id`,`result_name`,`id`,`name`,`type`,`data`,`etag`,`created_time`,`updated_time`) VALUES ("foo","deleted","deleted","28","baz","","","28-1740085271539878966","2025-02-20 21:01:11.539","2025-02-20 21:01:11.539") RETURNING `created_time`,`updated_time`
--- PASS: TestCreateRecord_ConcurrentDelete (0.06s)
=== RUN   TestGetRecord
    records_test.go:185: test database:  /tmp/testdb2711874191
    db.go:69: /home/prow/go/src/github.com/tektoncd/results/pkg/api/server/test/db.go:59
        [0.033ms] [rows:0] PRAGMA foreign_keys = ON;
... skipping 439 lines ...
    db.go:69: /home/prow/go/src/github.com/tektoncd/results/pkg/api/server/v1alpha2/results.go:208
        [0.657ms] [rows:1] SELECT * FROM `results` WHERE `results`.`parent` = "foo" AND `results`.`name` = "bar" ORDER BY `results`.`id` LIMIT 1
=== RUN   TestCreateResult/mismatched_parent
=== RUN   TestCreateResult/missing_name
=== RUN   TestCreateResult/already_exists
=== NAME  TestCreateResult
    db.go:69: /home/prow/go/src/github.com/tektoncd/results/pkg/api/server/v1alpha2/results.go:72 UNIQUE constraint failed: results.parent, results.name
        [0.874ms] [rows:0] INSERT INTO `results` (`parent`,`id`,`name`,`annotations`,`recordsummary_record`,`recordsummary_type`,`recordsummary_start_time`,`recordsummary_end_time`,`recordsummary_status`,`recordsummary_annotations`,`etag`,`created_time`,`updated_time`) VALUES ("foo","40","bar","{""foo"":""bar""}","","",NULL,NULL,0,"null","40-1740085296539878966","2025-02-20 21:01:36.539","2025-02-20 21:01:36.539") RETURNING `created_time`,`updated_time`
=== RUN   TestCreateResult/large_name
=== RUN   TestCreateResult/large_result_summary_type
--- PASS: TestCreateResult (0.08s)
    --- PASS: TestCreateResult/success (0.01s)
    --- PASS: TestCreateResult/mismatched_parent (0.00s)
... skipping 901 lines ...
=== RUN   TestMatch/no_filter
=== RUN   TestMatch/matching_condition
=== RUN   TestMatch/non-matching_condition
=== RUN   TestMatch/nil_result
=== RUN   TestMatch/non-bool_output
=== RUN   TestMatch/wrong_resource_type
2025/02/20 21:01:08 failed to evaluate the expression: no such attribute(s): record
--- PASS: TestMatch (0.02s)
    --- PASS: TestMatch/no_filter (0.00s)
    --- PASS: TestMatch/matching_condition (0.01s)
    --- PASS: TestMatch/non-matching_condition (0.00s)
    --- PASS: TestMatch/nil_result (0.00s)
    --- PASS: TestMatch/non-bool_output (0.00s)
... skipping 379 lines ...
    db.go:69: /home/prow/go/src/github.com/tektoncd/results/pkg/api/server/v1alpha2/records.go:102
        [0.549ms] [rows:1] SELECT `results`.`name`,`results`.`id` FROM `results` WHERE `results`.`parent` = "ns" AND `results`.`name` = "12345" ORDER BY `results`.`id` LIMIT 1
    db.go:69: /home/prow/go/src/github.com/tektoncd/results/pkg/api/server/v1alpha2/records.go:82
        [5.140ms] [rows:1] INSERT INTO `records` (`parent`,`result_id`,`result_name`,`id`,`name`,`type`,`data`,`etag`,`created_time`,`updated_time`) VALUES ("ns","f991d94d-84b3-49d0-9404-5c4bb936d0c8","12345","7e7a4d98-63ef-4d22-8cd0-c0b9cd9922ab","aa4028eb-8ac2-3055-9427-7a43b28476a8","results.tekton.dev/v1alpha3.Log","{""kind"":""Log"",""apiVersion"":""results.tekton.dev/v1alpha3"",""metadata"":{""name"":""taskrun-log"",""namespace"":""ns"",""uid"":""aa4028eb-8ac2-3055-9427-7a43b28476a8"",""creationTimestamp"":null},""spec"":{""resource"":{""kind"":""TaskRun"",""namespace"":""ns"",""name"":""taskrun"",""uid"":""12345""},""type"":""File""},""status"":{""size"":0,""isStored"":false,""errorOnStoreMsg"":"""",""isRetryableErr"":false}}","7e7a4d98-63ef-4d22-8cd0-c0b9cd9922ab-1740085287761577686","2025-02-20 21:01:27.761","2025-02-20 21:01:27.761") RETURNING `created_time`,`updated_time`
    logger.go:146: 2025-02-20T21:01:27.768Z	DEBUG	TestReconcile_TaskRun	dynamic/dynamic.go:289	Skipping CRD annotation patch: annotation update is disabled
    logger.go:146: 2025-02-20T21:01:27.768Z	DEBUG	TestReconcile_TaskRun	dynamic/dynamic.go:472	Streaming log started	{"namespace": "ns", "kind": "TaskRun", "name": "taskrun"}
    logger.go:146: 2025-02-20T21:01:27.769Z	ERROR	TestReconcile_TaskRun	dynamic/dynamic.go:480	Error streaming log	{"namespace": "ns", "kind": "TaskRun", "name": "taskrun", "error": "failed to create tkn reader: Parsing kubeconfig failed: invalid configuration: no configuration has been provided, try setting KUBERNETES_MASTER environment variable"}
    logger.go:146: 2025-02-20T21:01:27.769Z	INFO	TestReconcile_TaskRun	dynamic/dynamic.go:488	Streaming log completed	{"namespace": "ns", "kind": "TaskRun", "name": "taskrun"}
    db.go:69: /home/prow/go/src/github.com/tektoncd/results/pkg/api/server/v1alpha2/results.go:208
        [0.941ms] [rows:1] SELECT * FROM `results` WHERE `results`.`parent` = "ns" AND `results`.`name` = "12345" ORDER BY `results`.`id` LIMIT 1
    logger.go:146: 2025-02-20T21:01:27.773Z	DEBUG	TestReconcile_TaskRun	results/results.go:210	No further actions to be done on the Result: no differences found	{"results.tekton.dev/result": "ns/results/12345", "results.tekton.dev/record": "ns/results/12345/records/12345", "results.tekton.dev/top-level-record": true}
    db.go:69: /home/prow/go/src/github.com/tektoncd/results/pkg/api/server/v1alpha2/records.go:135 record not found
        [0.384ms] [rows:0] SELECT * FROM `records` WHERE `records`.`parent` = "ns" AND `records`.`result_name` = "12345" AND `records`.`name` = "b24c29b6-298a-37c9-8908-1e602f585a3d" ORDER BY `records`.`id` LIMIT 1
... skipping 110 lines ...
    db.go:69: /home/prow/go/src/github.com/tektoncd/results/pkg/api/server/v1alpha2/records.go:135
        [0.532ms] [rows:1] SELECT * FROM `records` WHERE `records`.`parent` = "ns" AND `records`.`result_name` = "12345" AND `records`.`name` = "12345" ORDER BY `records`.`id` LIMIT 1
    logger.go:146: 2025-02-20T21:01:27.982Z	DEBUG	TestReconcile_TaskRun	results/results.go:326	Updating Record	{"results.tekton.dev/record": "ns/results/12345/records/12345"}
    db.go:69: /home/prow/go/src/github.com/tektoncd/results/pkg/api/server/v1alpha2/records.go:135
        [0.657ms] [rows:1] SELECT * FROM `records` WHERE `records`.`parent` = "ns" AND `records`.`result_name` = "12345" AND `records`.`name` = "12345" ORDER BY `records`.`id` LIMIT 1
    db.go:69: /home/prow/go/src/github.com/tektoncd/results/pkg/api/server/v1alpha2/records.go:217
        [0.758ms] [rows:1] UPDATE `records` SET `result_name`="12345",`name`="12345",`type`="tekton.dev/v1.TaskRun",`data`="{""kind"":""TaskRun"",""apiVersion"":""tekton.dev/v1"",""metadata"":{""name"":""taskrun"",""namespace"":""ns"",""uid"":""12345"",""creationTimestamp"":null,""annotations"":{""demo"":""demo""}},""spec"":{""serviceAccountName"":"""",""taskSpec"":{""steps"":[{""name"":"""",""computeResources"":{},""script"":""echo hello world!""}]}},""status"":{""conditions"":[{""type"":""Succeeded"",""status"":""False"",""lastTransitionTime"":""2025-02-20T21:01:27Z"",""reason"":""Failed"",""message"":""Failed""}],""podName"":"""",""startTime"":""2025-02-20T21:01:27Z"",""completionTime"":""2025-02-20T21:01:29Z""}}",`created_time`="2025-02-20 21:01:27.734",`updated_time`="2025-02-20 21:01:27.984",`etag`="172f1821-03e6-4da2-a760-72d94678c7ab-1740085287984864217" WHERE `parent` = "ns" AND `result_id` = "f991d94d-84b3-49d0-9404-5c4bb936d0c8" AND `id` = "172f1821-03e6-4da2-a760-72d94678c7ab"
    db.go:69: /home/prow/go/src/github.com/tektoncd/results/pkg/api/server/v1alpha2/results.go:208
        [0.651ms] [rows:1] SELECT * FROM `results` WHERE `results`.`parent` = "ns" AND `results`.`name` = "12345" ORDER BY `results`.`id` LIMIT 1
    logger.go:146: 2025-02-20T21:01:27.995Z	DEBUG	TestReconcile_TaskRun	results/results.go:210	No further actions to be done on the Result: no differences found	{"results.tekton.dev/result": "ns/results/12345", "results.tekton.dev/record": "ns/results/12345/records/12345", "results.tekton.dev/top-level-record": true}
    db.go:69: /home/prow/go/src/github.com/tektoncd/results/pkg/api/server/v1alpha2/records.go:135
        [0.622ms] [rows:1] SELECT * FROM `records` WHERE `records`.`parent` = "ns" AND `records`.`result_name` = "12345" AND `records`.`name` = "aa4028eb-8ac2-3055-9427-7a43b28476a8" ORDER BY `records`.`id` LIMIT 1
    db.go:69: /home/prow/go/src/github.com/tektoncd/results/pkg/api/server/v1alpha2/results.go:208
... skipping 34 lines ...
    db.go:69: /home/prow/go/src/github.com/tektoncd/results/pkg/api/server/v1alpha2/records.go:135
        [0.367ms] [rows:1] SELECT * FROM `records` WHERE `records`.`parent` = "ns" AND `records`.`result_name` = "12345" AND `records`.`name` = "12345" ORDER BY `records`.`id` LIMIT 1
    logger.go:146: 2025-02-20T21:01:28.054Z	DEBUG	TestReconcile_TaskRun	results/results.go:326	Updating Record	{"results.tekton.dev/record": "ns/results/12345/records/12345"}
    db.go:69: /home/prow/go/src/github.com/tektoncd/results/pkg/api/server/v1alpha2/records.go:135
        [0.539ms] [rows:1] SELECT * FROM `records` WHERE `records`.`parent` = "ns" AND `records`.`result_name` = "12345" AND `records`.`name` = "12345" ORDER BY `records`.`id` LIMIT 1
    db.go:69: /home/prow/go/src/github.com/tektoncd/results/pkg/api/server/v1alpha2/records.go:217
        [0.522ms] [rows:1] UPDATE `records` SET `result_name`="12345",`name`="12345",`type`="tekton.dev/v1.TaskRun",`data`="{""kind"":""TaskRun"",""apiVersion"":""tekton.dev/v1"",""metadata"":{""name"":""taskrun"",""namespace"":""ns"",""uid"":""12345"",""creationTimestamp"":null,""labels"":{""x"":""foo""},""annotations"":{""demo"":""demo""}},""spec"":{""serviceAccountName"":"""",""taskSpec"":{""steps"":[{""name"":"""",""computeResources"":{},""script"":""echo hello world!""}]}},""status"":{""conditions"":[{""type"":""Succeeded"",""status"":""False"",""lastTransitionTime"":""2025-02-20T21:01:27Z"",""reason"":""Failed"",""message"":""Failed""}],""podName"":"""",""startTime"":""2025-02-20T21:01:27Z"",""completionTime"":""2025-02-20T21:01:29Z""}}",`created_time`="2025-02-20 21:01:27.734",`updated_time`="2025-02-20 21:01:28.056",`etag`="172f1821-03e6-4da2-a760-72d94678c7ab-1740085288056458300" WHERE `parent` = "ns" AND `result_id` = "f991d94d-84b3-49d0-9404-5c4bb936d0c8" AND `id` = "172f1821-03e6-4da2-a760-72d94678c7ab"
    db.go:69: /home/prow/go/src/github.com/tektoncd/results/pkg/api/server/v1alpha2/results.go:208
        [0.610ms] [rows:1] SELECT * FROM `results` WHERE `results`.`parent` = "ns" AND `results`.`name` = "12345" ORDER BY `results`.`id` LIMIT 1
    logger.go:146: 2025-02-20T21:01:28.066Z	DEBUG	TestReconcile_TaskRun	results/results.go:210	No further actions to be done on the Result: no differences found	{"results.tekton.dev/result": "ns/results/12345", "results.tekton.dev/record": "ns/results/12345/records/12345", "results.tekton.dev/top-level-record": true}
    db.go:69: /home/prow/go/src/github.com/tektoncd/results/pkg/api/server/v1alpha2/records.go:135
        [0.509ms] [rows:1] SELECT * FROM `records` WHERE `records`.`parent` = "ns" AND `records`.`result_name` = "12345" AND `records`.`name` = "aa4028eb-8ac2-3055-9427-7a43b28476a8" ORDER BY `records`.`id` LIMIT 1
    db.go:69: /home/prow/go/src/github.com/tektoncd/results/pkg/api/server/v1alpha2/results.go:208
... skipping 52 lines ...
    db.go:69: /home/prow/go/src/github.com/tektoncd/results/pkg/api/server/v1alpha2/records.go:135
        [0.569ms] [rows:1] SELECT * FROM `records` WHERE `records`.`parent` = "ns" AND `records`.`result_name` = "12345" AND `records`.`name` = "12345" ORDER BY `records`.`id` LIMIT 1
    logger.go:146: 2025-02-20T21:01:28.170Z	DEBUG	TestReconcile_TaskRun	results/results.go:326	Updating Record	{"results.tekton.dev/record": "ns/results/12345/records/12345"}
    db.go:69: /home/prow/go/src/github.com/tektoncd/results/pkg/api/server/v1alpha2/records.go:135
        [0.452ms] [rows:1] SELECT * FROM `records` WHERE `records`.`parent` = "ns" AND `records`.`result_name` = "12345" AND `records`.`name` = "12345" ORDER BY `records`.`id` LIMIT 1
    db.go:69: /home/prow/go/src/github.com/tektoncd/results/pkg/api/server/v1alpha2/records.go:217
        [0.505ms] [rows:1] UPDATE `records` SET `result_name`="12345",`name`="12345",`type`="tekton.dev/v1.TaskRun",`data`="{""kind"":""TaskRun"",""apiVersion"":""tekton.dev/v1"",""metadata"":{""name"":""taskrun"",""namespace"":""ns"",""uid"":""12345"",""creationTimestamp"":null,""labels"":{""x"":""foo""},""annotations"":{""x"":""foo""}},""spec"":{""serviceAccountName"":"""",""taskSpec"":{""steps"":[{""name"":"""",""computeResources"":{},""script"":""echo hello world!""}]}},""status"":{""conditions"":[{""type"":""Succeeded"",""status"":""False"",""lastTransitionTime"":""2025-02-20T21:01:27Z"",""reason"":""Failed"",""message"":""Failed""}],""podName"":"""",""startTime"":""2025-02-20T21:01:27Z"",""completionTime"":""2025-02-20T21:01:29Z""}}",`created_time`="2025-02-20 21:01:27.734",`updated_time`="2025-02-20 21:01:28.171",`etag`="172f1821-03e6-4da2-a760-72d94678c7ab-1740085288171949981" WHERE `parent` = "ns" AND `result_id` = "f991d94d-84b3-49d0-9404-5c4bb936d0c8" AND `id` = "172f1821-03e6-4da2-a760-72d94678c7ab"
    db.go:69: /home/prow/go/src/github.com/tektoncd/results/pkg/api/server/v1alpha2/results.go:208
        [0.560ms] [rows:1] SELECT * FROM `results` WHERE `results`.`parent` = "ns" AND `results`.`name` = "12345" ORDER BY `results`.`id` LIMIT 1
    logger.go:146: 2025-02-20T21:01:28.182Z	DEBUG	TestReconcile_TaskRun	results/results.go:210	No further actions to be done on the Result: no differences found	{"results.tekton.dev/result": "ns/results/12345", "results.tekton.dev/record": "ns/results/12345/records/12345", "results.tekton.dev/top-level-record": true}
    db.go:69: /home/prow/go/src/github.com/tektoncd/results/pkg/api/server/v1alpha2/records.go:135
        [0.621ms] [rows:1] SELECT * FROM `records` WHERE `records`.`parent` = "ns" AND `records`.`result_name` = "12345" AND `records`.`name` = "aa4028eb-8ac2-3055-9427-7a43b28476a8" ORDER BY `records`.`id` LIMIT 1
    db.go:69: /home/prow/go/src/github.com/tektoncd/results/pkg/api/server/v1alpha2/results.go:208
... skipping 14 lines ...
    db.go:69: /home/prow/go/src/github.com/tektoncd/results/pkg/api/server/v1alpha2/records.go:135
        [0.606ms] [rows:1] SELECT * FROM `records` WHERE `records`.`parent` = "ns" AND `records`.`result_name` = "12345" AND `records`.`name` = "12345" ORDER BY `records`.`id` LIMIT 1
    logger.go:146: 2025-02-20T21:01:28.214Z	DEBUG	TestReconcile_TaskRun	results/results.go:326	Updating Record	{"results.tekton.dev/record": "ns/results/12345/records/12345"}
    db.go:69: /home/prow/go/src/github.com/tektoncd/results/pkg/api/server/v1alpha2/records.go:135
        [0.439ms] [rows:1] SELECT * FROM `records` WHERE `records`.`parent` = "ns" AND `records`.`result_name` = "12345" AND `records`.`name` = "12345" ORDER BY `records`.`id` LIMIT 1
    db.go:69: /home/prow/go/src/github.com/tektoncd/results/pkg/api/server/v1alpha2/records.go:217
        [0.508ms] [rows:1] UPDATE `records` SET `result_name`="12345",`name`="12345",`type`="tekton.dev/v1.TaskRun",`data`="{""kind"":""TaskRun"",""apiVersion"":""tekton.dev/v1"",""metadata"":{""name"":""taskrun"",""namespace"":""ns"",""uid"":""12345"",""creationTimestamp"":null,""labels"":{""x"":""foo""},""annotations"":{""x"":""foo""},""ownerReferences"":[{""apiVersion"":""v1"",""kind"":""test"",""name"":""test-owner"",""uid"":""""}]},""spec"":{""serviceAccountName"":"""",""taskSpec"":{""steps"":[{""name"":"""",""computeResources"":{},""script"":""echo hello world!""}]}},""status"":{""conditions"":[{""type"":""Succeeded"",""status"":""False"",""lastTransitionTime"":""2025-02-20T21:01:27Z"",""reason"":""Failed"",""message"":""Failed""}],""podName"":"""",""startTime"":""2025-02-20T21:01:27Z"",""completionTime"":""2025-02-20T21:01:29Z""}}",`created_time`="2025-02-20 21:01:27.734",`updated_time`="2025-02-20 21:01:28.217",`etag`="172f1821-03e6-4da2-a760-72d94678c7ab-1740085288217053327" WHERE `parent` = "ns" AND `result_id` = "f991d94d-84b3-49d0-9404-5c4bb936d0c8" AND `id` = "172f1821-03e6-4da2-a760-72d94678c7ab"
    db.go:69: /home/prow/go/src/github.com/tektoncd/results/pkg/api/server/v1alpha2/results.go:208
        [0.756ms] [rows:1] SELECT * FROM `results` WHERE `results`.`parent` = "ns" AND `results`.`name` = "12345" ORDER BY `results`.`id` LIMIT 1
    logger.go:146: 2025-02-20T21:01:28.226Z	DEBUG	TestReconcile_TaskRun	results/results.go:202	No further actions to be done on the Result: the object is not a top level record	{"results.tekton.dev/result": "ns/results/12345", "results.tekton.dev/record": "ns/results/12345/records/12345", "results.tekton.dev/top-level-record": false}
    db.go:69: /home/prow/go/src/github.com/tektoncd/results/pkg/api/server/v1alpha2/records.go:135
        [0.669ms] [rows:1] SELECT * FROM `records` WHERE `records`.`parent` = "ns" AND `records`.`result_name` = "12345" AND `records`.`name` = "aa4028eb-8ac2-3055-9427-7a43b28476a8" ORDER BY `records`.`id` LIMIT 1
    db.go:69: /home/prow/go/src/github.com/tektoncd/results/pkg/api/server/v1alpha2/results.go:208
... skipping 16 lines ...
    db.go:69: /home/prow/go/src/github.com/tektoncd/results/pkg/api/server/v1alpha2/records.go:135 record not found
        [0.402ms] [rows:0] SELECT * FROM `records` WHERE `records`.`parent` = "ns" AND `records`.`result_name` = "6ee85768-ce9f-447d-86ca-db79011291a5" AND `records`.`name` = "12345" ORDER BY `records`.`id` LIMIT 1
    logger.go:146: 2025-02-20T21:01:28.251Z	DEBUG	TestReconcile_TaskRun	results/results.go:334	Record doesn't exist yet - creating	{"results.tekton.dev/record": "ns/results/6ee85768-ce9f-447d-86ca-db79011291a5/records/12345"}
    db.go:69: /home/prow/go/src/github.com/tektoncd/results/pkg/api/server/v1alpha2/records.go:102
        [0.306ms] [rows:1] SELECT `results`.`name`,`results`.`id` FROM `results` WHERE `results`.`parent` = "ns" AND `results`.`name` = "6ee85768-ce9f-447d-86ca-db79011291a5" ORDER BY `results`.`id` LIMIT 1
    db.go:69: /home/prow/go/src/github.com/tektoncd/results/pkg/api/server/v1alpha2/records.go:82
        [5.107ms] [rows:1] INSERT INTO `records` (`parent`,`result_id`,`result_name`,`id`,`name`,`type`,`data`,`etag`,`created_time`,`updated_time`) VALUES ("ns","f6c4627f-6b62-45a5-a115-8c6ea1865e2f","6ee85768-ce9f-447d-86ca-db79011291a5","d1756423-7e4e-42ba-9f3a-de6a71c78396","12345","tekton.dev/v1.TaskRun","{""kind"":""TaskRun"",""apiVersion"":""tekton.dev/v1"",""metadata"":{""name"":""taskrun"",""namespace"":""ns"",""uid"":""12345"",""creationTimestamp"":null,""labels"":{""x"":""foo""},""annotations"":{""x"":""foo""},""ownerReferences"":[{""apiVersion"":""tekton.dev/v1"",""kind"":""PipelineRun"",""name"":""test-pipelinerun"",""uid"":""6ee85768-ce9f-447d-86ca-db79011291a5""}]},""spec"":{""serviceAccountName"":"""",""taskSpec"":{""steps"":[{""name"":"""",""computeResources"":{},""script"":""echo hello world!""}]}},""status"":{""conditions"":[{""type"":""Succeeded"",""status"":""False"",""lastTransitionTime"":""2025-02-20T21:01:27Z"",""reason"":""Failed"",""message"":""Failed""}],""podName"":"""",""startTime"":""2025-02-20T21:01:27Z"",""completionTime"":""2025-02-20T21:01:29Z""}}","d1756423-7e4e-42ba-9f3a-de6a71c78396-1740085288253107063","2025-02-20 21:01:28.253","2025-02-20 21:01:28.253") RETURNING `created_time`,`updated_time`
    db.go:69: /home/prow/go/src/github.com/tektoncd/results/pkg/api/server/v1alpha2/results.go:208
        [0.616ms] [rows:1] SELECT * FROM `results` WHERE `results`.`parent` = "ns" AND `results`.`name` = "6ee85768-ce9f-447d-86ca-db79011291a5" ORDER BY `results`.`id` LIMIT 1
    logger.go:146: 2025-02-20T21:01:28.261Z	DEBUG	TestReconcile_TaskRun	results/results.go:202	No further actions to be done on the Result: the object is not a top level record	{"results.tekton.dev/result": "ns/results/6ee85768-ce9f-447d-86ca-db79011291a5", "results.tekton.dev/record": "ns/results/6ee85768-ce9f-447d-86ca-db79011291a5/records/12345", "results.tekton.dev/top-level-record": false}
    db.go:69: /home/prow/go/src/github.com/tektoncd/results/pkg/api/server/v1alpha2/records.go:135 record not found
        [0.413ms] [rows:0] SELECT * FROM `records` WHERE `records`.`parent` = "ns" AND `records`.`result_name` = "6ee85768-ce9f-447d-86ca-db79011291a5" AND `records`.`name` = "3032b98f-64c1-38df-955e-d10d0678e9f0" ORDER BY `records`.`id` LIMIT 1
    db.go:69: /home/prow/go/src/github.com/tektoncd/results/pkg/api/server/v1alpha2/results.go:208
... skipping 3 lines ...
        [0.301ms] [rows:0] SELECT * FROM `records` WHERE `records`.`parent` = "ns" AND `records`.`result_name` = "6ee85768-ce9f-447d-86ca-db79011291a5" AND `records`.`name` = "3032b98f-64c1-38df-955e-d10d0678e9f0" ORDER BY `records`.`id` LIMIT 1
    db.go:69: /home/prow/go/src/github.com/tektoncd/results/pkg/api/server/v1alpha2/records.go:102
        [0.296ms] [rows:1] SELECT `results`.`name`,`results`.`id` FROM `results` WHERE `results`.`parent` = "ns" AND `results`.`name` = "6ee85768-ce9f-447d-86ca-db79011291a5" ORDER BY `results`.`id` LIMIT 1
    db.go:69: /home/prow/go/src/github.com/tektoncd/results/pkg/api/server/v1alpha2/records.go:82
        [6.749ms] [rows:1] INSERT INTO `records` (`parent`,`result_id`,`result_name`,`id`,`name`,`type`,`data`,`etag`,`created_time`,`updated_time`) VALUES ("ns","f6c4627f-6b62-45a5-a115-8c6ea1865e2f","6ee85768-ce9f-447d-86ca-db79011291a5","c43b462c-b245-4c8c-a626-9a5e1e4061c5","3032b98f-64c1-38df-955e-d10d0678e9f0","results.tekton.dev/v1alpha3.Log","{""kind"":""Log"",""apiVersion"":""results.tekton.dev/v1alpha3"",""metadata"":{""name"":""taskrun-log"",""namespace"":""ns"",""uid"":""3032b98f-64c1-38df-955e-d10d0678e9f0"",""creationTimestamp"":null},""spec"":{""resource"":{""kind"":""TaskRun"",""namespace"":""ns"",""name"":""taskrun"",""uid"":""12345""},""type"":""File""},""status"":{""size"":0,""isStored"":false,""errorOnStoreMsg"":"""",""isRetryableErr"":false}}","c43b462c-b245-4c8c-a626-9a5e1e4061c5-1740085288268817332","2025-02-20 21:01:28.268","2025-02-20 21:01:28.268") RETURNING `created_time`,`updated_time`
    logger.go:146: 2025-02-20T21:01:28.278Z	DEBUG	TestReconcile_TaskRun	dynamic/dynamic.go:472	Streaming log started	{"namespace": "ns", "kind": "TaskRun", "name": "taskrun"}
    logger.go:146: 2025-02-20T21:01:28.279Z	ERROR	TestReconcile_TaskRun	dynamic/dynamic.go:480	Error streaming log	{"namespace": "ns", "kind": "TaskRun", "name": "taskrun", "error": "failed to create tkn reader: Parsing kubeconfig failed: invalid configuration: no configuration has been provided, try setting KUBERNETES_MASTER environment variable"}
    logger.go:146: 2025-02-20T21:01:28.279Z	INFO	TestReconcile_TaskRun	dynamic/dynamic.go:488	Streaming log completed	{"namespace": "ns", "kind": "TaskRun", "name": "taskrun"}
    db.go:69: /home/prow/go/src/github.com/tektoncd/results/pkg/api/server/v1alpha2/results.go:208
        [0.668ms] [rows:1] SELECT * FROM `results` WHERE `results`.`parent` = "ns" AND `results`.`name` = "6ee85768-ce9f-447d-86ca-db79011291a5" ORDER BY `results`.`id` LIMIT 1
    logger.go:146: 2025-02-20T21:01:28.286Z	DEBUG	TestReconcile_TaskRun	results/results.go:202	No further actions to be done on the Result: the object is not a top level record	{"results.tekton.dev/result": "ns/results/6ee85768-ce9f-447d-86ca-db79011291a5", "results.tekton.dev/record": "ns/results/6ee85768-ce9f-447d-86ca-db79011291a5/records/12345", "results.tekton.dev/top-level-record": false}
    db.go:69: /home/prow/go/src/github.com/tektoncd/results/pkg/api/server/v1alpha2/records.go:135 record not found
        [0.354ms] [rows:0] SELECT * FROM `records` WHERE `records`.`parent` = "ns" AND `records`.`result_name` = "6ee85768-ce9f-447d-86ca-db79011291a5" AND `records`.`name` = "599773d4-f152-3454-b7a3-c0c52476df5c" ORDER BY `records`.`id` LIMIT 1
... skipping 18 lines ...
    db.go:69: /home/prow/go/src/github.com/tektoncd/results/pkg/api/server/v1alpha2/records.go:135
        [0.409ms] [rows:1] SELECT * FROM `records` WHERE `records`.`parent` = "ns" AND `records`.`result_name` = "12345" AND `records`.`name` = "12345" ORDER BY `records`.`id` LIMIT 1
    logger.go:146: 2025-02-20T21:01:28.325Z	DEBUG	TestReconcile_TaskRun	results/results.go:326	Updating Record	{"results.tekton.dev/record": "ns/results/12345/records/12345"}
    db.go:69: /home/prow/go/src/github.com/tektoncd/results/pkg/api/server/v1alpha2/records.go:135
        [0.399ms] [rows:1] SELECT * FROM `records` WHERE `records`.`parent` = "ns" AND `records`.`result_name` = "12345" AND `records`.`name` = "12345" ORDER BY `records`.`id` LIMIT 1
    db.go:69: /home/prow/go/src/github.com/tektoncd/results/pkg/api/server/v1alpha2/records.go:217
        [0.600ms] [rows:1] UPDATE `records` SET `result_name`="12345",`name`="12345",`type`="tekton.dev/v1.TaskRun",`data`="{""kind"":""TaskRun"",""apiVersion"":""tekton.dev/v1"",""metadata"":{""name"":""taskrun"",""namespace"":""ns"",""uid"":""12345"",""creationTimestamp"":null,""labels"":{""x"":""foo""},""annotations"":{""x"":""foo""},""ownerReferences"":[{""apiVersion"":""v1"",""kind"":""test"",""name"":""test-owner"",""uid"":""c2d19caa-7182-4b7a-a193-fd7a662c1ad1""}]},""spec"":{""serviceAccountName"":"""",""taskSpec"":{""steps"":[{""name"":"""",""computeResources"":{},""script"":""echo hello world!""}]}},""status"":{""conditions"":[{""type"":""Succeeded"",""status"":""False"",""lastTransitionTime"":""2025-02-20T21:01:27Z"",""reason"":""Failed"",""message"":""Failed""}],""podName"":"""",""startTime"":""2025-02-20T21:01:27Z"",""completionTime"":""2025-02-20T21:01:29Z""}}",`created_time`="2025-02-20 21:01:27.734",`updated_time`="2025-02-20 21:01:28.328",`etag`="172f1821-03e6-4da2-a760-72d94678c7ab-1740085288328269997" WHERE `parent` = "ns" AND `result_id` = "f991d94d-84b3-49d0-9404-5c4bb936d0c8" AND `id` = "172f1821-03e6-4da2-a760-72d94678c7ab"
    db.go:69: /home/prow/go/src/github.com/tektoncd/results/pkg/api/server/v1alpha2/results.go:208
        [0.649ms] [rows:1] SELECT * FROM `results` WHERE `results`.`parent` = "ns" AND `results`.`name` = "12345" ORDER BY `results`.`id` LIMIT 1
    logger.go:146: 2025-02-20T21:01:28.344Z	DEBUG	TestReconcile_TaskRun	results/results.go:202	No further actions to be done on the Result: the object is not a top level record	{"results.tekton.dev/result": "ns/results/12345", "results.tekton.dev/record": "ns/results/12345/records/12345", "results.tekton.dev/top-level-record": false}
    db.go:69: /home/prow/go/src/github.com/tektoncd/results/pkg/api/server/v1alpha2/records.go:135
        [0.512ms] [rows:1] SELECT * FROM `records` WHERE `records`.`parent` = "ns" AND `records`.`result_name` = "12345" AND `records`.`name` = "aa4028eb-8ac2-3055-9427-7a43b28476a8" ORDER BY `records`.`id` LIMIT 1
    db.go:69: /home/prow/go/src/github.com/tektoncd/results/pkg/api/server/v1alpha2/results.go:208
... skipping 57 lines ...
        [0.275ms] [rows:0] SELECT * FROM `records` WHERE `records`.`parent` = "ns" AND `records`.`result_name` = "12345" AND `records`.`name` = "a8d8b968-22ba-39fd-9239-19ffce28e4a6" ORDER BY `records`.`id` LIMIT 1
    db.go:69: /home/prow/go/src/github.com/tektoncd/results/pkg/api/server/v1alpha2/records.go:102
        [0.402ms] [rows:1] SELECT `results`.`name`,`results`.`id` FROM `results` WHERE `results`.`parent` = "ns" AND `results`.`name` = "12345" ORDER BY `results`.`id` LIMIT 1
    db.go:69: /home/prow/go/src/github.com/tektoncd/results/pkg/api/server/v1alpha2/records.go:82
        [6.192ms] [rows:1] INSERT INTO `records` (`parent`,`result_id`,`result_name`,`id`,`name`,`type`,`data`,`etag`,`created_time`,`updated_time`) VALUES ("ns","1b8060c3-b082-4d0e-8c74-3b50be9032fc","12345","6fe1aede-2f02-40f9-9636-02affe4c3180","a8d8b968-22ba-39fd-9239-19ffce28e4a6","results.tekton.dev/v1alpha3.Log","{""kind"":""Log"",""apiVersion"":""results.tekton.dev/v1alpha3"",""metadata"":{""name"":""pipelinerun-log"",""namespace"":""ns"",""uid"":""a8d8b968-22ba-39fd-9239-19ffce28e4a6"",""creationTimestamp"":null},""spec"":{""resource"":{""kind"":""PipelineRun"",""namespace"":""ns"",""name"":""pipelinerun"",""uid"":""12345""},""type"":""File""},""status"":{""size"":0,""isStored"":false,""errorOnStoreMsg"":"""",""isRetryableErr"":false}}","6fe1aede-2f02-40f9-9636-02affe4c3180-1740085288474002694","2025-02-20 21:01:28.474","2025-02-20 21:01:28.474") RETURNING `created_time`,`updated_time`
    logger.go:146: 2025-02-20T21:01:28.484Z	DEBUG	TestReconcile_PipelineRun	dynamic/dynamic.go:472	Streaming log started	{"namespace": "ns", "kind": "PipelineRun", "name": "pipelinerun"}
    logger.go:146: 2025-02-20T21:01:28.485Z	ERROR	TestReconcile_PipelineRun	dynamic/dynamic.go:480	Error streaming log	{"namespace": "ns", "kind": "PipelineRun", "name": "pipelinerun", "error": "failed to create tkn reader: Parsing kubeconfig failed: invalid configuration: no configuration has been provided, try setting KUBERNETES_MASTER environment variable"}
    logger.go:146: 2025-02-20T21:01:28.485Z	INFO	TestReconcile_PipelineRun	dynamic/dynamic.go:488	Streaming log completed	{"namespace": "ns", "kind": "PipelineRun", "name": "pipelinerun"}
    db.go:69: /home/prow/go/src/github.com/tektoncd/results/pkg/api/server/v1alpha2/results.go:208
        [0.675ms] [rows:1] SELECT * FROM `results` WHERE `results`.`parent` = "ns" AND `results`.`name` = "12345" ORDER BY `results`.`id` LIMIT 1
    logger.go:146: 2025-02-20T21:01:28.488Z	DEBUG	TestReconcile_PipelineRun	results/results.go:210	No further actions to be done on the Result: no differences found	{"results.tekton.dev/result": "ns/results/12345", "results.tekton.dev/record": "ns/results/12345/records/12345", "results.tekton.dev/top-level-record": true}
    db.go:69: /home/prow/go/src/github.com/tektoncd/results/pkg/api/server/v1alpha2/records.go:135 record not found
        [0.445ms] [rows:0] SELECT * FROM `records` WHERE `records`.`parent` = "ns" AND `records`.`result_name` = "12345" AND `records`.`name` = "e03b00d9-228d-3258-a1ee-3dea3ef4cdf6" ORDER BY `records`.`id` LIMIT 1
... skipping 399 lines ...
        --- PASS: TestPut/pipelinerun/update (0.01s)
PASS
ok  	github.com/tektoncd/results/pkg/watcher/results	2.132s
testing: warning: no tests to run
PASS
ok  	github.com/tektoncd/results/tools/postgres-migrate	1.087s [no tests to run]
FAIL
unit_tests returning 
===========================
==== UNIT TESTS FAILED ====
===========================
+ EXIT_VALUE=1
+ set +o xtrace