ResultFAILURE
Tests 0 failed / 0 succeeded
Started2025-04-02 04:31
Elapsed4m44s
Revisionf280a614d81f5656cea260bc14c09954405c8360
Refs 988

No Test Failures!


Error lines from build-log.txt

... skipping 2114 lines ...
git version 2.43.0
============================
==== RUNNING UNIT TESTS ====
============================
/home/prow/go/src/github.com/tektoncd/results /home/prow/go/src/github.com/tektoncd/results
Using overridden unit_tests
2025/04/02 04:34:38 maxprocs: Leaving GOMAXPROCS=16: CPU quota undefined
=== RUN   Test_determineAuth
=== RUN   Test_determineAuth/missing_token
=== RUN   Test_determineAuth/invalid_token
=== RUN   Test_determineAuth/valid_token
--- PASS: Test_determineAuth (0.00s)
    --- PASS: Test_determineAuth/missing_token (0.00s)
... skipping 20 lines ...
          []string{
        - 	"a.b",
          	"d.e",
          	"f",
        + 	"a.b",
          }
--- FAIL: TestFieldMask_Paths (0.00s)
=== RUN   TestFieldMask_Filter
--- PASS: TestFieldMask_Filter (0.01s)
=== RUN   TestFieldMask_FilterJSON
--- PASS: TestFieldMask_FilterJSON (0.00s)
=== RUN   TestFromMetadata
--- PASS: TestFromMetadata (0.00s)
=== RUN   TestMetadataAnnotator
--- PASS: TestMetadataAnnotator (0.00s)
FAIL
FAIL	github.com/tektoncd/results/internal/fieldmask	0.082s
=== RUN   TestParseFilter
=== RUN   TestParseFilter/success
=== RUN   TestParseFilter/success/#00
=== RUN   TestParseFilter/success/result
=== RUN   TestParseFilter/success/result.id
=== RUN   TestParseFilter/success/result.id_==_"1"
=== RUN   TestParseFilter/success/result.id_==_"1"_||_result.name_==_"2"
=== RUN   TestParseFilter/success/result.id.startsWith("tacocat")
=== RUN   TestParseFilter/error
=== RUN   TestParseFilter/error/asdf
=== RUN   TestParseFilter/error/result.id_==_1
=== RUN   TestParseFilter/error/result.ID
--- PASS: TestParseFilter (0.05s)
    --- PASS: TestParseFilter/success (0.03s)
        --- PASS: TestParseFilter/success/#00 (0.00s)
        --- PASS: TestParseFilter/success/result (0.01s)
        --- PASS: TestParseFilter/success/result.id (0.00s)
        --- PASS: TestParseFilter/success/result.id_==_"1" (0.00s)
        --- PASS: TestParseFilter/success/result.id_==_"1"_||_result.name_==_"2" (0.00s)
        --- PASS: TestParseFilter/success/result.id.startsWith("tacocat") (0.01s)
    --- PASS: TestParseFilter/error (0.00s)
        --- PASS: TestParseFilter/error/asdf (0.00s)
        --- PASS: TestParseFilter/error/result.id_==_1 (0.00s)
        --- PASS: TestParseFilter/error/result.ID (0.00s)
PASS
ok  	github.com/tektoncd/results/pkg/api/server/cel	1.104s
=== RUN   TestConvertRecordExpressions
=== RUN   TestConvertRecordExpressions/simple_expression
    convert_test.go:170: want: (name = 'foo')
    convert_test.go:171: got:  (name = 'foo')
... skipping 338 lines ...
    db.go:69: /home/prow/go/src/github.com/tektoncd/results/pkg/api/server/v1alpha2/logs.go:352
        [1.121ms] [rows:3] SELECT * FROM `records` WHERE type = "results.tekton.dev/v1alpha3.Log" AND id > "" AND parent = "foo" AND result_name = "bar" ORDER BY created_time LIMIT 51
=== RUN   TestListLogs/unknown_type
=== RUN   TestListLogs/unknown_any_field
=== RUN   TestListLogs/invalid_page_size
=== RUN   TestListLogs/malformed_parent
{"level":"error","ts":1743568525.541016,"caller":"v1alpha2/logs.go:268","msg":"rpc error: code = InvalidArgument desc = name must match (^[a-z0-9_-]{1,63})/results/([a-z0-9_-]{1,63}$)","stacktrace":"github.com/tektoncd/results/pkg/api/server/v1alpha2.(*Server).ListLogs\n\t/home/prow/go/src/github.com/tektoncd/results/pkg/api/server/v1alpha2/logs.go:268\ngithub.com/tektoncd/results/pkg/api/server/v1alpha2.TestListLogs.func1\n\t/home/prow/go/src/github.com/tektoncd/results/pkg/api/server/v1alpha2/logs_test.go:569\ntesting.tRunner\n\t/usr/local/go/src/testing/testing.go:1690"}
=== RUN   TestListLogs/invalid_order_by_clause
=== RUN   TestListLogs/invalid_sort_direction
--- PASS: TestListLogs (0.86s)
    --- PASS: TestListLogs/all (0.08s)
    --- PASS: TestListLogs/list_all_records_without_knowing_the_result_name (0.07s)
    --- PASS: TestListLogs/list_all_records_without_knowing_the_parent_and_the_result_name (0.07s)
... skipping 171 lines ...
=== RUN   TestCreateRecord/missing_name
=== RUN   TestCreateRecord/result_used_as_name
=== RUN   TestCreateRecord/already_exists
=== NAME  TestCreateRecord
    db.go:69: /home/prow/go/src/github.com/tektoncd/results/pkg/api/server/v1alpha2/records.go:102
        [0.367ms] [rows:1] SELECT `results`.`name`,`results`.`id` FROM `results` WHERE `results`.`parent` = "foo" AND `results`.`name` = "bar" ORDER BY `results`.`id` LIMIT 1
    db.go:69: /home/prow/go/src/github.com/tektoncd/results/pkg/api/server/v1alpha2/records.go:82 UNIQUE constraint failed: records.parent, records.result_name, records.name
        [0.672ms] [rows:0] INSERT INTO `records` (`parent`,`result_id`,`result_name`,`id`,`name`,`type`,`data`,`etag`,`created_time`,`updated_time`) VALUES ("foo","25","bar","27","baz","TaskRun","{""metadata"":{""name"":""tacocat"",""creationTimestamp"":null},""spec"":{""serviceAccountName"":""""},""status"":{""podName"":""""}}","27-1743568527294639096","2025-04-02 04:35:27.294","2025-04-02 04:35:27.294") RETURNING `created_time`,`updated_time`
--- PASS: TestCreateRecord (0.10s)
    --- PASS: TestCreateRecord/success (0.02s)
    --- PASS: TestCreateRecord/mismatched_parent (0.00s)
    --- PASS: TestCreateRecord/parent_does_not_exist (0.00s)
    --- PASS: TestCreateRecord/missing_name (0.00s)
... skipping 13 lines ...
        [0.113ms] [rows:-] SELECT count(*) FROM sqlite_master WHERE type='table' AND name="records"
    db.go:69: /home/prow/go/src/github.com/tektoncd/results/pkg/api/server/v1alpha2/server.go:96
        [5.508ms] [rows:0] CREATE TABLE `records` (`parent` text,`result_id` text,`result_name` text,`id` text,`name` text,`type` text,`data` jsonb,`created_time` datetime DEFAULT current_timestamp,`updated_time` datetime DEFAULT current_timestamp,`etag` text,PRIMARY KEY (`parent`,`result_id`,`id`),CONSTRAINT `fk_records_result` FOREIGN KEY (`parent`,`result_id`) REFERENCES `results`(`parent`,`id`) ON DELETE CASCADE ON UPDATE CASCADE)
    db.go:69: /home/prow/go/src/github.com/tektoncd/results/pkg/api/server/v1alpha2/server.go:96
        [5.429ms] [rows:0] CREATE UNIQUE INDEX `records_by_name` ON `records`(`parent`,`result_name`,`name`)
{"level":"warn","ts":1743568526.022889,"caller":"plugin/plugin_logs.go:429","msg":"Plugin Logs API Disable: unsupported type of logs given for plugin, legacy logging system might work"}
    db.go:69: /home/prow/go/src/github.com/tektoncd/results/pkg/api/server/v1alpha2/records.go:82 FOREIGN KEY constraint failed
        [1.117ms] [rows:0] INSERT INTO `records` (`parent`,`result_id`,`result_name`,`id`,`name`,`type`,`data`,`etag`,`created_time`,`updated_time`) VALUES ("foo","deleted","deleted","28","baz","","","28-1743568527294639096","2025-04-02 04:35:27.294","2025-04-02 04:35:27.294") RETURNING `created_time`,`updated_time`
--- PASS: TestCreateRecord_ConcurrentDelete (0.04s)
=== RUN   TestGetRecord
    records_test.go:185: test database:  /tmp/testdb865895953
    db.go:69: /home/prow/go/src/github.com/tektoncd/results/pkg/api/server/test/db.go:59
        [0.045ms] [rows:0] PRAGMA foreign_keys = ON;
... skipping 439 lines ...
    db.go:69: /home/prow/go/src/github.com/tektoncd/results/pkg/api/server/v1alpha2/results.go:208
        [2.617ms] [rows:1] SELECT * FROM `results` WHERE `results`.`parent` = "foo" AND `results`.`name` = "bar" ORDER BY `results`.`id` LIMIT 1
=== RUN   TestCreateResult/mismatched_parent
=== RUN   TestCreateResult/missing_name
=== RUN   TestCreateResult/already_exists
=== NAME  TestCreateResult
    db.go:69: /home/prow/go/src/github.com/tektoncd/results/pkg/api/server/v1alpha2/results.go:72 UNIQUE constraint failed: results.parent, results.name
        [0.701ms] [rows:0] INSERT INTO `results` (`parent`,`id`,`name`,`annotations`,`recordsummary_record`,`recordsummary_type`,`recordsummary_start_time`,`recordsummary_end_time`,`recordsummary_status`,`recordsummary_annotations`,`etag`,`created_time`,`updated_time`) VALUES ("foo","40","bar","{""foo"":""bar""}","","",NULL,NULL,0,"null","40-1743568552294639096","2025-04-02 04:35:52.294","2025-04-02 04:35:52.294") RETURNING `created_time`,`updated_time`
=== RUN   TestCreateResult/large_name
=== RUN   TestCreateResult/large_result_summary_type
--- PASS: TestCreateResult (0.11s)
    --- PASS: TestCreateResult/success (0.02s)
    --- PASS: TestCreateResult/mismatched_parent (0.00s)
... skipping 903 lines ...
=== RUN   TestMatch/no_filter
=== RUN   TestMatch/matching_condition
=== RUN   TestMatch/non-matching_condition
=== RUN   TestMatch/nil_result
=== RUN   TestMatch/non-bool_output
=== RUN   TestMatch/wrong_resource_type
2025/04/02 04:35:34 failed to evaluate the expression: no such attribute(s): record
--- PASS: TestMatch (0.04s)
    --- PASS: TestMatch/no_filter (0.00s)
    --- PASS: TestMatch/matching_condition (0.02s)
    --- PASS: TestMatch/non-matching_condition (0.00s)
    --- PASS: TestMatch/nil_result (0.00s)
    --- PASS: TestMatch/non-bool_output (0.00s)
... skipping 420 lines ...
    db.go:69: /home/prow/go/src/github.com/tektoncd/results/pkg/api/server/v1alpha2/records.go:102
        [0.460ms] [rows:1] SELECT `results`.`name`,`results`.`id` FROM `results` WHERE `results`.`parent` = "ns" AND `results`.`name` = "12345" ORDER BY `results`.`id` LIMIT 1
    db.go:69: /home/prow/go/src/github.com/tektoncd/results/pkg/api/server/v1alpha2/records.go:82
        [46.929ms] [rows:1] INSERT INTO `records` (`parent`,`result_id`,`result_name`,`id`,`name`,`type`,`data`,`etag`,`created_time`,`updated_time`) VALUES ("ns","911fedec-8c82-40ba-a17f-ee5a992b0619","12345","266109a0-e8a9-41c0-8696-e3f56e58fc1c","bdc6c04c-b179-3391-8d4f-586af8c54234","results.tekton.dev/v1alpha3.Log","{""kind"":""Log"",""apiVersion"":""results.tekton.dev/v1alpha3"",""metadata"":{""name"":""taskrun-log"",""namespace"":""ns"",""uid"":""bdc6c04c-b179-3391-8d4f-586af8c54234"",""creationTimestamp"":null},""spec"":{""resource"":{""kind"":""TaskRun"",""namespace"":""ns"",""name"":""taskrun"",""uid"":""12345""},""type"":""File""},""status"":{""size"":0,""isStored"":false,""errorOnStoreMsg"":"""",""isRetryableErr"":false}}","266109a0-e8a9-41c0-8696-e3f56e58fc1c-1743568566511787239","2025-04-02 04:36:06.511","2025-04-02 04:36:06.511") RETURNING `created_time`,`updated_time`
    logger.go:146: 2025-04-02T04:36:06.560Z	DEBUG	TestReconcile_TaskRun	dynamic/dynamic.go:289	Skipping CRD annotation patch: annotation update is disabled
    logger.go:146: 2025-04-02T04:36:06.560Z	DEBUG	TestReconcile_TaskRun	dynamic/dynamic.go:472	Streaming log started	{"namespace": "ns", "kind": "TaskRun", "name": "taskrun"}
    logger.go:146: 2025-04-02T04:36:06.561Z	ERROR	TestReconcile_TaskRun	dynamic/dynamic.go:480	Error streaming log	{"namespace": "ns", "kind": "TaskRun", "name": "taskrun", "error": "failed to create tkn reader: Parsing kubeconfig failed: invalid configuration: no configuration has been provided, try setting KUBERNETES_MASTER environment variable"}
    logger.go:146: 2025-04-02T04:36:06.561Z	INFO	TestReconcile_TaskRun	dynamic/dynamic.go:488	Streaming log completed	{"namespace": "ns", "kind": "TaskRun", "name": "taskrun"}
    db.go:69: /home/prow/go/src/github.com/tektoncd/results/pkg/api/server/v1alpha2/results.go:208
        [0.680ms] [rows:1] SELECT * FROM `results` WHERE `results`.`parent` = "ns" AND `results`.`name` = "12345" ORDER BY `results`.`id` LIMIT 1
    logger.go:146: 2025-04-02T04:36:06.564Z	DEBUG	TestReconcile_TaskRun	results/results.go:210	No further actions to be done on the Result: no differences found	{"results.tekton.dev/result": "ns/results/12345", "results.tekton.dev/record": "ns/results/12345/records/12345", "results.tekton.dev/top-level-record": true}
    db.go:69: /home/prow/go/src/github.com/tektoncd/results/pkg/api/server/v1alpha2/records.go:135 record not found
        [0.357ms] [rows:0] SELECT * FROM `records` WHERE `records`.`parent` = "ns" AND `records`.`result_name` = "12345" AND `records`.`name` = "9986b512-0b02-3edb-be6e-8298d24e6fb6" ORDER BY `records`.`id` LIMIT 1
... skipping 110 lines ...
    db.go:69: /home/prow/go/src/github.com/tektoncd/results/pkg/api/server/v1alpha2/records.go:135
        [0.486ms] [rows:1] SELECT * FROM `records` WHERE `records`.`parent` = "ns" AND `records`.`result_name` = "12345" AND `records`.`name` = "12345" ORDER BY `records`.`id` LIMIT 1
    logger.go:146: 2025-04-02T04:36:06.756Z	DEBUG	TestReconcile_TaskRun	results/results.go:326	Updating Record	{"results.tekton.dev/record": "ns/results/12345/records/12345"}
    db.go:69: /home/prow/go/src/github.com/tektoncd/results/pkg/api/server/v1alpha2/records.go:135
        [0.490ms] [rows:1] SELECT * FROM `records` WHERE `records`.`parent` = "ns" AND `records`.`result_name` = "12345" AND `records`.`name` = "12345" ORDER BY `records`.`id` LIMIT 1
    db.go:69: /home/prow/go/src/github.com/tektoncd/results/pkg/api/server/v1alpha2/records.go:217
        [0.475ms] [rows:1] UPDATE `records` SET `result_name`="12345",`name`="12345",`type`="tekton.dev/v1.TaskRun",`data`="{""kind"":""TaskRun"",""apiVersion"":""tekton.dev/v1"",""metadata"":{""name"":""taskrun"",""namespace"":""ns"",""uid"":""12345"",""creationTimestamp"":null,""annotations"":{""demo"":""demo""}},""spec"":{""serviceAccountName"":"""",""taskSpec"":{""steps"":[{""name"":"""",""computeResources"":{},""script"":""echo hello world!""}]}},""status"":{""conditions"":[{""type"":""Succeeded"",""status"":""False"",""lastTransitionTime"":""2025-04-02T04:36:06Z"",""reason"":""Failed"",""message"":""Failed""}],""podName"":"""",""startTime"":""2025-04-02T04:36:06Z"",""completionTime"":""2025-04-02T04:36:08Z""}}",`created_time`="2025-04-02 04:36:06.489",`updated_time`="2025-04-02 04:36:06.758",`etag`="8fcd4db0-817a-42c6-b111-11de9b245851-1743568566758358198" WHERE `parent` = "ns" AND `result_id` = "911fedec-8c82-40ba-a17f-ee5a992b0619" AND `id` = "8fcd4db0-817a-42c6-b111-11de9b245851"
    db.go:69: /home/prow/go/src/github.com/tektoncd/results/pkg/api/server/v1alpha2/results.go:208
        [0.540ms] [rows:1] SELECT * FROM `results` WHERE `results`.`parent` = "ns" AND `results`.`name` = "12345" ORDER BY `results`.`id` LIMIT 1
    logger.go:146: 2025-04-02T04:36:06.807Z	DEBUG	TestReconcile_TaskRun	results/results.go:210	No further actions to be done on the Result: no differences found	{"results.tekton.dev/result": "ns/results/12345", "results.tekton.dev/record": "ns/results/12345/records/12345", "results.tekton.dev/top-level-record": true}
    db.go:69: /home/prow/go/src/github.com/tektoncd/results/pkg/api/server/v1alpha2/records.go:135
        [0.565ms] [rows:1] SELECT * FROM `records` WHERE `records`.`parent` = "ns" AND `records`.`result_name` = "12345" AND `records`.`name` = "bdc6c04c-b179-3391-8d4f-586af8c54234" ORDER BY `records`.`id` LIMIT 1
    db.go:69: /home/prow/go/src/github.com/tektoncd/results/pkg/api/server/v1alpha2/results.go:208
... skipping 34 lines ...
    db.go:69: /home/prow/go/src/github.com/tektoncd/results/pkg/api/server/v1alpha2/records.go:135
        [0.546ms] [rows:1] SELECT * FROM `records` WHERE `records`.`parent` = "ns" AND `records`.`result_name` = "12345" AND `records`.`name` = "12345" ORDER BY `records`.`id` LIMIT 1
    logger.go:146: 2025-04-02T04:36:06.870Z	DEBUG	TestReconcile_TaskRun	results/results.go:326	Updating Record	{"results.tekton.dev/record": "ns/results/12345/records/12345"}
    db.go:69: /home/prow/go/src/github.com/tektoncd/results/pkg/api/server/v1alpha2/records.go:135
        [0.556ms] [rows:1] SELECT * FROM `records` WHERE `records`.`parent` = "ns" AND `records`.`result_name` = "12345" AND `records`.`name` = "12345" ORDER BY `records`.`id` LIMIT 1
    db.go:69: /home/prow/go/src/github.com/tektoncd/results/pkg/api/server/v1alpha2/records.go:217
        [0.588ms] [rows:1] UPDATE `records` SET `result_name`="12345",`name`="12345",`type`="tekton.dev/v1.TaskRun",`data`="{""kind"":""TaskRun"",""apiVersion"":""tekton.dev/v1"",""metadata"":{""name"":""taskrun"",""namespace"":""ns"",""uid"":""12345"",""creationTimestamp"":null,""labels"":{""x"":""foo""},""annotations"":{""demo"":""demo""}},""spec"":{""serviceAccountName"":"""",""taskSpec"":{""steps"":[{""name"":"""",""computeResources"":{},""script"":""echo hello world!""}]}},""status"":{""conditions"":[{""type"":""Succeeded"",""status"":""False"",""lastTransitionTime"":""2025-04-02T04:36:06Z"",""reason"":""Failed"",""message"":""Failed""}],""podName"":"""",""startTime"":""2025-04-02T04:36:06Z"",""completionTime"":""2025-04-02T04:36:08Z""}}",`created_time`="2025-04-02 04:36:06.489",`updated_time`="2025-04-02 04:36:06.872",`etag`="8fcd4db0-817a-42c6-b111-11de9b245851-1743568566872930474" WHERE `parent` = "ns" AND `result_id` = "911fedec-8c82-40ba-a17f-ee5a992b0619" AND `id` = "8fcd4db0-817a-42c6-b111-11de9b245851"
    db.go:69: /home/prow/go/src/github.com/tektoncd/results/pkg/api/server/v1alpha2/results.go:208
        [0.511ms] [rows:1] SELECT * FROM `results` WHERE `results`.`parent` = "ns" AND `results`.`name` = "12345" ORDER BY `results`.`id` LIMIT 1
    logger.go:146: 2025-04-02T04:36:06.924Z	DEBUG	TestReconcile_TaskRun	results/results.go:210	No further actions to be done on the Result: no differences found	{"results.tekton.dev/result": "ns/results/12345", "results.tekton.dev/record": "ns/results/12345/records/12345", "results.tekton.dev/top-level-record": true}
    db.go:69: /home/prow/go/src/github.com/tektoncd/results/pkg/api/server/v1alpha2/records.go:135
        [0.479ms] [rows:1] SELECT * FROM `records` WHERE `records`.`parent` = "ns" AND `records`.`result_name` = "12345" AND `records`.`name` = "bdc6c04c-b179-3391-8d4f-586af8c54234" ORDER BY `records`.`id` LIMIT 1
    db.go:69: /home/prow/go/src/github.com/tektoncd/results/pkg/api/server/v1alpha2/results.go:208
... skipping 52 lines ...
    db.go:69: /home/prow/go/src/github.com/tektoncd/results/pkg/api/server/v1alpha2/records.go:135
        [0.450ms] [rows:1] SELECT * FROM `records` WHERE `records`.`parent` = "ns" AND `records`.`result_name` = "12345" AND `records`.`name` = "12345" ORDER BY `records`.`id` LIMIT 1
    logger.go:146: 2025-04-02T04:36:07.019Z	DEBUG	TestReconcile_TaskRun	results/results.go:326	Updating Record	{"results.tekton.dev/record": "ns/results/12345/records/12345"}
    db.go:69: /home/prow/go/src/github.com/tektoncd/results/pkg/api/server/v1alpha2/records.go:135
        [0.503ms] [rows:1] SELECT * FROM `records` WHERE `records`.`parent` = "ns" AND `records`.`result_name` = "12345" AND `records`.`name` = "12345" ORDER BY `records`.`id` LIMIT 1
    db.go:69: /home/prow/go/src/github.com/tektoncd/results/pkg/api/server/v1alpha2/records.go:217
        [0.520ms] [rows:1] UPDATE `records` SET `result_name`="12345",`name`="12345",`type`="tekton.dev/v1.TaskRun",`data`="{""kind"":""TaskRun"",""apiVersion"":""tekton.dev/v1"",""metadata"":{""name"":""taskrun"",""namespace"":""ns"",""uid"":""12345"",""creationTimestamp"":null,""labels"":{""x"":""foo""},""annotations"":{""x"":""foo""}},""spec"":{""serviceAccountName"":"""",""taskSpec"":{""steps"":[{""name"":"""",""computeResources"":{},""script"":""echo hello world!""}]}},""status"":{""conditions"":[{""type"":""Succeeded"",""status"":""False"",""lastTransitionTime"":""2025-04-02T04:36:06Z"",""reason"":""Failed"",""message"":""Failed""}],""podName"":"""",""startTime"":""2025-04-02T04:36:06Z"",""completionTime"":""2025-04-02T04:36:08Z""}}",`created_time`="2025-04-02 04:36:06.489",`updated_time`="2025-04-02 04:36:07.022",`etag`="8fcd4db0-817a-42c6-b111-11de9b245851-1743568567022016498" WHERE `parent` = "ns" AND `result_id` = "911fedec-8c82-40ba-a17f-ee5a992b0619" AND `id` = "8fcd4db0-817a-42c6-b111-11de9b245851"
    db.go:69: /home/prow/go/src/github.com/tektoncd/results/pkg/api/server/v1alpha2/results.go:208
        [0.551ms] [rows:1] SELECT * FROM `results` WHERE `results`.`parent` = "ns" AND `results`.`name` = "12345" ORDER BY `results`.`id` LIMIT 1
    logger.go:146: 2025-04-02T04:36:07.032Z	DEBUG	TestReconcile_TaskRun	results/results.go:210	No further actions to be done on the Result: no differences found	{"results.tekton.dev/result": "ns/results/12345", "results.tekton.dev/record": "ns/results/12345/records/12345", "results.tekton.dev/top-level-record": true}
    db.go:69: /home/prow/go/src/github.com/tektoncd/results/pkg/api/server/v1alpha2/records.go:135
        [0.536ms] [rows:1] SELECT * FROM `records` WHERE `records`.`parent` = "ns" AND `records`.`result_name` = "12345" AND `records`.`name` = "bdc6c04c-b179-3391-8d4f-586af8c54234" ORDER BY `records`.`id` LIMIT 1
    db.go:69: /home/prow/go/src/github.com/tektoncd/results/pkg/api/server/v1alpha2/results.go:208
... skipping 14 lines ...
    db.go:69: /home/prow/go/src/github.com/tektoncd/results/pkg/api/server/v1alpha2/records.go:135
        [0.517ms] [rows:1] SELECT * FROM `records` WHERE `records`.`parent` = "ns" AND `records`.`result_name` = "12345" AND `records`.`name` = "12345" ORDER BY `records`.`id` LIMIT 1
    logger.go:146: 2025-04-02T04:36:07.074Z	DEBUG	TestReconcile_TaskRun	results/results.go:326	Updating Record	{"results.tekton.dev/record": "ns/results/12345/records/12345"}
    db.go:69: /home/prow/go/src/github.com/tektoncd/results/pkg/api/server/v1alpha2/records.go:135
        [0.584ms] [rows:1] SELECT * FROM `records` WHERE `records`.`parent` = "ns" AND `records`.`result_name` = "12345" AND `records`.`name` = "12345" ORDER BY `records`.`id` LIMIT 1
    db.go:69: /home/prow/go/src/github.com/tektoncd/results/pkg/api/server/v1alpha2/records.go:217
        [0.640ms] [rows:1] UPDATE `records` SET `result_name`="12345",`name`="12345",`type`="tekton.dev/v1.TaskRun",`data`="{""kind"":""TaskRun"",""apiVersion"":""tekton.dev/v1"",""metadata"":{""name"":""taskrun"",""namespace"":""ns"",""uid"":""12345"",""creationTimestamp"":null,""labels"":{""x"":""foo""},""annotations"":{""x"":""foo""},""ownerReferences"":[{""apiVersion"":""v1"",""kind"":""test"",""name"":""test-owner"",""uid"":""""}]},""spec"":{""serviceAccountName"":"""",""taskSpec"":{""steps"":[{""name"":"""",""computeResources"":{},""script"":""echo hello world!""}]}},""status"":{""conditions"":[{""type"":""Succeeded"",""status"":""False"",""lastTransitionTime"":""2025-04-02T04:36:06Z"",""reason"":""Failed"",""message"":""Failed""}],""podName"":"""",""startTime"":""2025-04-02T04:36:06Z"",""completionTime"":""2025-04-02T04:36:08Z""}}",`created_time`="2025-04-02 04:36:06.489",`updated_time`="2025-04-02 04:36:07.077",`etag`="8fcd4db0-817a-42c6-b111-11de9b245851-1743568567077002644" WHERE `parent` = "ns" AND `result_id` = "911fedec-8c82-40ba-a17f-ee5a992b0619" AND `id` = "8fcd4db0-817a-42c6-b111-11de9b245851"
    db.go:69: /home/prow/go/src/github.com/tektoncd/results/pkg/api/server/v1alpha2/results.go:208
        [0.666ms] [rows:1] SELECT * FROM `results` WHERE `results`.`parent` = "ns" AND `results`.`name` = "12345" ORDER BY `results`.`id` LIMIT 1
    logger.go:146: 2025-04-02T04:36:07.086Z	DEBUG	TestReconcile_TaskRun	results/results.go:202	No further actions to be done on the Result: the object is not a top level record	{"results.tekton.dev/result": "ns/results/12345", "results.tekton.dev/record": "ns/results/12345/records/12345", "results.tekton.dev/top-level-record": false}
    db.go:69: /home/prow/go/src/github.com/tektoncd/results/pkg/api/server/v1alpha2/records.go:135
        [0.548ms] [rows:1] SELECT * FROM `records` WHERE `records`.`parent` = "ns" AND `records`.`result_name` = "12345" AND `records`.`name` = "bdc6c04c-b179-3391-8d4f-586af8c54234" ORDER BY `records`.`id` LIMIT 1
    db.go:69: /home/prow/go/src/github.com/tektoncd/results/pkg/api/server/v1alpha2/results.go:208
... skipping 16 lines ...
    db.go:69: /home/prow/go/src/github.com/tektoncd/results/pkg/api/server/v1alpha2/records.go:135 record not found
        [0.420ms] [rows:0] SELECT * FROM `records` WHERE `records`.`parent` = "ns" AND `records`.`result_name` = "30cf837f-42c5-41f0-a23e-2d56f8461fff" AND `records`.`name` = "12345" ORDER BY `records`.`id` LIMIT 1
    logger.go:146: 2025-04-02T04:36:07.150Z	DEBUG	TestReconcile_TaskRun	results/results.go:334	Record doesn't exist yet - creating	{"results.tekton.dev/record": "ns/results/30cf837f-42c5-41f0-a23e-2d56f8461fff/records/12345"}
    db.go:69: /home/prow/go/src/github.com/tektoncd/results/pkg/api/server/v1alpha2/records.go:102
        [0.347ms] [rows:1] SELECT `results`.`name`,`results`.`id` FROM `results` WHERE `results`.`parent` = "ns" AND `results`.`name` = "30cf837f-42c5-41f0-a23e-2d56f8461fff" ORDER BY `results`.`id` LIMIT 1
    db.go:69: /home/prow/go/src/github.com/tektoncd/results/pkg/api/server/v1alpha2/records.go:82
        [6.082ms] [rows:1] INSERT INTO `records` (`parent`,`result_id`,`result_name`,`id`,`name`,`type`,`data`,`etag`,`created_time`,`updated_time`) VALUES ("ns","f038d9d7-72b7-4028-a4bc-a8a366bbe81d","30cf837f-42c5-41f0-a23e-2d56f8461fff","c2262068-101e-4305-827c-3e806f5faa6d","12345","tekton.dev/v1.TaskRun","{""kind"":""TaskRun"",""apiVersion"":""tekton.dev/v1"",""metadata"":{""name"":""taskrun"",""namespace"":""ns"",""uid"":""12345"",""creationTimestamp"":null,""labels"":{""x"":""foo""},""annotations"":{""x"":""foo""},""ownerReferences"":[{""apiVersion"":""tekton.dev/v1"",""kind"":""PipelineRun"",""name"":""test-pipelinerun"",""uid"":""30cf837f-42c5-41f0-a23e-2d56f8461fff""}]},""spec"":{""serviceAccountName"":"""",""taskSpec"":{""steps"":[{""name"":"""",""computeResources"":{},""script"":""echo hello world!""}]}},""status"":{""conditions"":[{""type"":""Succeeded"",""status"":""False"",""lastTransitionTime"":""2025-04-02T04:36:06Z"",""reason"":""Failed"",""message"":""Failed""}],""podName"":"""",""startTime"":""2025-04-02T04:36:06Z"",""completionTime"":""2025-04-02T04:36:08Z""}}","c2262068-101e-4305-827c-3e806f5faa6d-1743568567152427179","2025-04-02 04:36:07.152","2025-04-02 04:36:07.152") RETURNING `created_time`,`updated_time`
    db.go:69: /home/prow/go/src/github.com/tektoncd/results/pkg/api/server/v1alpha2/results.go:208
        [0.692ms] [rows:1] SELECT * FROM `results` WHERE `results`.`parent` = "ns" AND `results`.`name` = "30cf837f-42c5-41f0-a23e-2d56f8461fff" ORDER BY `results`.`id` LIMIT 1
    logger.go:146: 2025-04-02T04:36:07.162Z	DEBUG	TestReconcile_TaskRun	results/results.go:202	No further actions to be done on the Result: the object is not a top level record	{"results.tekton.dev/result": "ns/results/30cf837f-42c5-41f0-a23e-2d56f8461fff", "results.tekton.dev/record": "ns/results/30cf837f-42c5-41f0-a23e-2d56f8461fff/records/12345", "results.tekton.dev/top-level-record": false}
    db.go:69: /home/prow/go/src/github.com/tektoncd/results/pkg/api/server/v1alpha2/records.go:135 record not found
        [0.357ms] [rows:0] SELECT * FROM `records` WHERE `records`.`parent` = "ns" AND `records`.`result_name` = "30cf837f-42c5-41f0-a23e-2d56f8461fff" AND `records`.`name` = "f56d1f56-f6de-3d4e-99a9-e9cbaa680e4d" ORDER BY `records`.`id` LIMIT 1
    db.go:69: /home/prow/go/src/github.com/tektoncd/results/pkg/api/server/v1alpha2/results.go:208
... skipping 3 lines ...
        [0.318ms] [rows:0] SELECT * FROM `records` WHERE `records`.`parent` = "ns" AND `records`.`result_name` = "30cf837f-42c5-41f0-a23e-2d56f8461fff" AND `records`.`name` = "f56d1f56-f6de-3d4e-99a9-e9cbaa680e4d" ORDER BY `records`.`id` LIMIT 1
    db.go:69: /home/prow/go/src/github.com/tektoncd/results/pkg/api/server/v1alpha2/records.go:102
        [0.377ms] [rows:1] SELECT `results`.`name`,`results`.`id` FROM `results` WHERE `results`.`parent` = "ns" AND `results`.`name` = "30cf837f-42c5-41f0-a23e-2d56f8461fff" ORDER BY `results`.`id` LIMIT 1
    db.go:69: /home/prow/go/src/github.com/tektoncd/results/pkg/api/server/v1alpha2/records.go:82
        [5.523ms] [rows:1] INSERT INTO `records` (`parent`,`result_id`,`result_name`,`id`,`name`,`type`,`data`,`etag`,`created_time`,`updated_time`) VALUES ("ns","f038d9d7-72b7-4028-a4bc-a8a366bbe81d","30cf837f-42c5-41f0-a23e-2d56f8461fff","d14108d3-4555-4f43-a1bb-ec6088fe8ec1","f56d1f56-f6de-3d4e-99a9-e9cbaa680e4d","results.tekton.dev/v1alpha3.Log","{""kind"":""Log"",""apiVersion"":""results.tekton.dev/v1alpha3"",""metadata"":{""name"":""taskrun-log"",""namespace"":""ns"",""uid"":""f56d1f56-f6de-3d4e-99a9-e9cbaa680e4d"",""creationTimestamp"":null},""spec"":{""resource"":{""kind"":""TaskRun"",""namespace"":""ns"",""name"":""taskrun"",""uid"":""12345""},""type"":""File""},""status"":{""size"":0,""isStored"":false,""errorOnStoreMsg"":"""",""isRetryableErr"":false}}","d14108d3-4555-4f43-a1bb-ec6088fe8ec1-1743568567169373560","2025-04-02 04:36:07.169","2025-04-02 04:36:07.169") RETURNING `created_time`,`updated_time`
    logger.go:146: 2025-04-02T04:36:07.178Z	DEBUG	TestReconcile_TaskRun	dynamic/dynamic.go:472	Streaming log started	{"namespace": "ns", "kind": "TaskRun", "name": "taskrun"}
    logger.go:146: 2025-04-02T04:36:07.178Z	ERROR	TestReconcile_TaskRun	dynamic/dynamic.go:480	Error streaming log	{"namespace": "ns", "kind": "TaskRun", "name": "taskrun", "error": "failed to create tkn reader: Parsing kubeconfig failed: invalid configuration: no configuration has been provided, try setting KUBERNETES_MASTER environment variable"}
    logger.go:146: 2025-04-02T04:36:07.178Z	INFO	TestReconcile_TaskRun	dynamic/dynamic.go:488	Streaming log completed	{"namespace": "ns", "kind": "TaskRun", "name": "taskrun"}
    db.go:69: /home/prow/go/src/github.com/tektoncd/results/pkg/api/server/v1alpha2/results.go:208
        [0.500ms] [rows:1] SELECT * FROM `results` WHERE `results`.`parent` = "ns" AND `results`.`name` = "30cf837f-42c5-41f0-a23e-2d56f8461fff" ORDER BY `results`.`id` LIMIT 1
    logger.go:146: 2025-04-02T04:36:07.180Z	DEBUG	TestReconcile_TaskRun	results/results.go:202	No further actions to be done on the Result: the object is not a top level record	{"results.tekton.dev/result": "ns/results/30cf837f-42c5-41f0-a23e-2d56f8461fff", "results.tekton.dev/record": "ns/results/30cf837f-42c5-41f0-a23e-2d56f8461fff/records/12345", "results.tekton.dev/top-level-record": false}
    db.go:69: /home/prow/go/src/github.com/tektoncd/results/pkg/api/server/v1alpha2/records.go:135 record not found
        [0.371ms] [rows:0] SELECT * FROM `records` WHERE `records`.`parent` = "ns" AND `records`.`result_name` = "30cf837f-42c5-41f0-a23e-2d56f8461fff" AND `records`.`name` = "22a4ba3e-c843-3751-8513-9e98723537a6" ORDER BY `records`.`id` LIMIT 1
... skipping 18 lines ...
    db.go:69: /home/prow/go/src/github.com/tektoncd/results/pkg/api/server/v1alpha2/records.go:135
        [0.630ms] [rows:1] SELECT * FROM `records` WHERE `records`.`parent` = "ns" AND `records`.`result_name` = "12345" AND `records`.`name` = "12345" ORDER BY `records`.`id` LIMIT 1
    logger.go:146: 2025-04-02T04:36:07.222Z	DEBUG	TestReconcile_TaskRun	results/results.go:326	Updating Record	{"results.tekton.dev/record": "ns/results/12345/records/12345"}
    db.go:69: /home/prow/go/src/github.com/tektoncd/results/pkg/api/server/v1alpha2/records.go:135
        [0.506ms] [rows:1] SELECT * FROM `records` WHERE `records`.`parent` = "ns" AND `records`.`result_name` = "12345" AND `records`.`name` = "12345" ORDER BY `records`.`id` LIMIT 1
    db.go:69: /home/prow/go/src/github.com/tektoncd/results/pkg/api/server/v1alpha2/records.go:217
        [0.598ms] [rows:1] UPDATE `records` SET `result_name`="12345",`name`="12345",`type`="tekton.dev/v1.TaskRun",`data`="{""kind"":""TaskRun"",""apiVersion"":""tekton.dev/v1"",""metadata"":{""name"":""taskrun"",""namespace"":""ns"",""uid"":""12345"",""creationTimestamp"":null,""labels"":{""x"":""foo""},""annotations"":{""x"":""foo""},""ownerReferences"":[{""apiVersion"":""v1"",""kind"":""test"",""name"":""test-owner"",""uid"":""fbc5da18-1626-4a6b-9d5a-a9f94a4d2a29""}]},""spec"":{""serviceAccountName"":"""",""taskSpec"":{""steps"":[{""name"":"""",""computeResources"":{},""script"":""echo hello world!""}]}},""status"":{""conditions"":[{""type"":""Succeeded"",""status"":""False"",""lastTransitionTime"":""2025-04-02T04:36:06Z"",""reason"":""Failed"",""message"":""Failed""}],""podName"":"""",""startTime"":""2025-04-02T04:36:06Z"",""completionTime"":""2025-04-02T04:36:08Z""}}",`created_time`="2025-04-02 04:36:06.489",`updated_time`="2025-04-02 04:36:07.224",`etag`="8fcd4db0-817a-42c6-b111-11de9b245851-1743568567224357069" WHERE `parent` = "ns" AND `result_id` = "911fedec-8c82-40ba-a17f-ee5a992b0619" AND `id` = "8fcd4db0-817a-42c6-b111-11de9b245851"
    db.go:69: /home/prow/go/src/github.com/tektoncd/results/pkg/api/server/v1alpha2/results.go:208
        [0.584ms] [rows:1] SELECT * FROM `results` WHERE `results`.`parent` = "ns" AND `results`.`name` = "12345" ORDER BY `results`.`id` LIMIT 1
    logger.go:146: 2025-04-02T04:36:07.273Z	DEBUG	TestReconcile_TaskRun	results/results.go:202	No further actions to be done on the Result: the object is not a top level record	{"results.tekton.dev/result": "ns/results/12345", "results.tekton.dev/record": "ns/results/12345/records/12345", "results.tekton.dev/top-level-record": false}
    db.go:69: /home/prow/go/src/github.com/tektoncd/results/pkg/api/server/v1alpha2/records.go:135
        [0.669ms] [rows:1] SELECT * FROM `records` WHERE `records`.`parent` = "ns" AND `records`.`result_name` = "12345" AND `records`.`name` = "bdc6c04c-b179-3391-8d4f-586af8c54234" ORDER BY `records`.`id` LIMIT 1
    db.go:69: /home/prow/go/src/github.com/tektoncd/results/pkg/api/server/v1alpha2/results.go:208
... skipping 57 lines ...
        [0.372ms] [rows:0] SELECT * FROM `records` WHERE `records`.`parent` = "ns" AND `records`.`result_name` = "12345" AND `records`.`name` = "6ce4e4ea-30d4-3106-be4d-2489e36f7bf5" ORDER BY `records`.`id` LIMIT 1
    db.go:69: /home/prow/go/src/github.com/tektoncd/results/pkg/api/server/v1alpha2/records.go:102
        [0.387ms] [rows:1] SELECT `results`.`name`,`results`.`id` FROM `results` WHERE `results`.`parent` = "ns" AND `results`.`name` = "12345" ORDER BY `results`.`id` LIMIT 1
    db.go:69: /home/prow/go/src/github.com/tektoncd/results/pkg/api/server/v1alpha2/records.go:82
        [5.553ms] [rows:1] INSERT INTO `records` (`parent`,`result_id`,`result_name`,`id`,`name`,`type`,`data`,`etag`,`created_time`,`updated_time`) VALUES ("ns","2cf0c66d-1ca4-43ba-a353-9b2878ba0155","12345","28818bf6-2b68-49e7-a22a-ab94ddf98aa6","6ce4e4ea-30d4-3106-be4d-2489e36f7bf5","results.tekton.dev/v1alpha3.Log","{""kind"":""Log"",""apiVersion"":""results.tekton.dev/v1alpha3"",""metadata"":{""name"":""pipelinerun-log"",""namespace"":""ns"",""uid"":""6ce4e4ea-30d4-3106-be4d-2489e36f7bf5"",""creationTimestamp"":null},""spec"":{""resource"":{""kind"":""PipelineRun"",""namespace"":""ns"",""name"":""pipelinerun"",""uid"":""12345""},""type"":""File""},""status"":{""size"":0,""isStored"":false,""errorOnStoreMsg"":"""",""isRetryableErr"":false}}","28818bf6-2b68-49e7-a22a-ab94ddf98aa6-1743568567373074697","2025-04-02 04:36:07.373","2025-04-02 04:36:07.373") RETURNING `created_time`,`updated_time`
    logger.go:146: 2025-04-02T04:36:07.382Z	DEBUG	TestReconcile_PipelineRun	dynamic/dynamic.go:472	Streaming log started	{"namespace": "ns", "kind": "PipelineRun", "name": "pipelinerun"}
    logger.go:146: 2025-04-02T04:36:07.383Z	ERROR	TestReconcile_PipelineRun	dynamic/dynamic.go:480	Error streaming log	{"namespace": "ns", "kind": "PipelineRun", "name": "pipelinerun", "error": "failed to create tkn reader: Parsing kubeconfig failed: invalid configuration: no configuration has been provided, try setting KUBERNETES_MASTER environment variable"}
    logger.go:146: 2025-04-02T04:36:07.383Z	INFO	TestReconcile_PipelineRun	dynamic/dynamic.go:488	Streaming log completed	{"namespace": "ns", "kind": "PipelineRun", "name": "pipelinerun"}
    db.go:69: /home/prow/go/src/github.com/tektoncd/results/pkg/api/server/v1alpha2/results.go:208
        [0.662ms] [rows:1] SELECT * FROM `results` WHERE `results`.`parent` = "ns" AND `results`.`name` = "12345" ORDER BY `results`.`id` LIMIT 1
    logger.go:146: 2025-04-02T04:36:07.386Z	DEBUG	TestReconcile_PipelineRun	results/results.go:210	No further actions to be done on the Result: no differences found	{"results.tekton.dev/result": "ns/results/12345", "results.tekton.dev/record": "ns/results/12345/records/12345", "results.tekton.dev/top-level-record": true}
    db.go:69: /home/prow/go/src/github.com/tektoncd/results/pkg/api/server/v1alpha2/records.go:135 record not found
        [0.444ms] [rows:0] SELECT * FROM `records` WHERE `records`.`parent` = "ns" AND `records`.`result_name` = "12345" AND `records`.`name` = "85d8b4f3-66cf-3db7-8d40-e9a2d44fa67e" ORDER BY `records`.`id` LIMIT 1
... skipping 399 lines ...
        --- PASS: TestPut/pipelinerun/update (0.01s)
PASS
ok  	github.com/tektoncd/results/pkg/watcher/results	1.933s
testing: warning: no tests to run
PASS
ok  	github.com/tektoncd/results/tools/postgres-migrate	1.082s [no tests to run]
FAIL
unit_tests returning 
===========================
==== UNIT TESTS FAILED ====
===========================
+ EXIT_VALUE=1
+ set +o xtrace