Result | FAILURE |
Tests | 0 failed / 23 succeeded |
Started | |
Elapsed | 14m51s |
Revision | 221d738e487c6842709baece64772d6838864620 |
Refs |
1647 |
E2E:Machine | n1-standard-4 |
E2E:MaxNodes | 3 |
E2E:MinNodes | 1 |
E2E:Region | us-central1 |
E2E:Version | 1.31.4-gke.1256000 |
cmd/binding-eval/cmd TestEvalBinding
cmd/cel-eval/cmd TestEvalCEL
cmd/triggerrun/cmd TestReadHTTP
cmd/triggerrun/cmd TestReadTrigger
cmd/triggerrun/cmd TestTrigger_Error
cmd/triggerrun/cmd Test_processTriggerSpec
cmd/triggerrun/cmd Test_processTriggerSpec/testing-name
test TestEventListenerCreate
test TestEventListenerScale
test TestGetResourcesFromClients
test TestGetResourcesFromClients/empty
test TestGetResourcesFromClients/one_resource_each
test TestGetResourcesFromClients/only_Deployments_(and_namespaces)
test TestGetResourcesFromClients/only_Services_(and_namespaces)
test TestGetResourcesFromClients/only_clustertriggerbindings
test TestGetResourcesFromClients/only_eventlisteners_(and_namespaces)
test TestGetResourcesFromClients/only_namespaces
test TestGetResourcesFromClients/only_pods_(and_namespaces)
test TestGetResourcesFromClients/only_secrets_(and_namespaces)
test TestGetResourcesFromClients/only_triggerBindings_(and_namespaces)
test TestGetResourcesFromClients/only_triggerTemplates_(and_namespaces)
test TestGetResourcesFromClients/two_resources_each
test TestHMACHeader
... skipping 1910 lines ... * Host localhost:8080 was resolved. * IPv6: ::1 * IPv4: 127.0.0.1 % Total % Received % Xferd Average Speed Time Time Time Current Dload Upload Total Spent Left Speed 0 0 0 0 0 0 0 0 --:--:-- --:--:-- --:--:-- 0* Trying [::1]:8080... * Immediate connect fail for ::1: Cannot assign requested address * Trying 127.0.0.1:8080... * connect to 127.0.0.1 port 8080 from 127.0.0.1 port 54510 failed: Connection refused * Failed to connect to localhost port 8080 after 0 ms: Couldn't connect to server 0 0 0 0 0 0 0 0 --:--:-- --:--:-- --:--:-- 0 * Closing connection curl: (7) Failed to connect to localhost port 8080 after 0 ms: Couldn't connect to server + response= + cleanup + info 'Cleaning up resources' + echo + echo '*** Example v1alpha1/bitbucket-server: Cleaning up resources ***' ... skipping 15 lines ... + kubectl delete -f /home/prow/go/src/github.com/tektoncd/triggers/examples/v1alpha1/bitbucket-server/triggerbinding.yaml --ignore-not-found triggerbinding.triggers.tekton.dev "bitbucket-server-binding" deleted + for y in ${yaml_files} + kubectl delete -f /home/prow/go/src/github.com/tektoncd/triggers/examples/v1alpha1/bitbucket-server/triggertemplate.yaml --ignore-not-found triggertemplate.triggers.tekton.dev "bitbucket-server-template" deleted *************************************** *** E2E TEST FAILED *** *** Start of information dump *** *************************************** >>> All resources: NAMESPACE NAME READY STATUS RESTARTS AGE default pod/el-bitbucket-server-listener-5999c47744-wxmnw 1/1 Terminating 0 18s gke-managed-cim pod/kube-state-metrics-0 2/2 Running 0 6m15s ... skipping 208 lines ... default 115s Normal Succeeded taskrun/create-ingress-taskrun All Steps have completed executing default 19s Normal Scheduled pod/el-bitbucket-server-listener-5999c47744-wxmnw Successfully assigned default/el-bitbucket-server-listener-5999c47744-wxmnw to gke-ttriggers-e2e-cls188-default-pool-696ba6a0-w32m default 19s Normal Pulled pod/el-bitbucket-server-listener-5999c47744-wxmnw Container image "gcr.io/tekton-prow-0/ttriggers-e2e-img/eventlistenersink-7ad1faa98cddbcb0c24990303b220bb8@sha256:875d785e81054cef48646863e1134e27c7e849aa9599f49b955c7cee0c456ccf" already present on machine default 19s Normal Created pod/el-bitbucket-server-listener-5999c47744-wxmnw Created container event-listener default 18s Normal Started pod/el-bitbucket-server-listener-5999c47744-wxmnw Started container event-listener default 2s Normal Killing pod/el-bitbucket-server-listener-5999c47744-wxmnw Stopping container event-listener default 19s Warning FailedCreate replicaset/el-bitbucket-server-listener-5999c47744 Error creating: pods "el-bitbucket-server-listener-5999c47744-" is forbidden: error looking up service account default/tekton-triggers-example-sa: serviceaccount "tekton-triggers-example-sa" not found default 19s Normal SuccessfulCreate replicaset/el-bitbucket-server-listener-5999c47744 Created pod: el-bitbucket-server-listener-5999c47744-wxmnw default 19s Normal ScalingReplicaSet deployment/el-bitbucket-server-listener Scaled up replica set el-bitbucket-server-listener-5999c47744 to 1 default 2m37s Warning FailedCreate replicaset/el-cel-eventlistener-no-filter-86584dc8cd Error creating: pods "el-cel-eventlistener-no-filter-86584dc8cd-" is forbidden: error looking up service account default/tekton-triggers-example-sa: serviceaccount "tekton-triggers-example-sa" not found default 2m30s Warning FailedCreate replicaset/el-cel-eventlistener-no-filter-86584dc8cd Error creating: pods "el-cel-eventlistener-no-filter-86584dc8cd-" is forbidden: error looking up service account default/tekton-triggers-example-sa: serviceaccount "tekton-triggers-example-sa" not found default 2m41s Normal ScalingReplicaSet deployment/el-cel-eventlistener-no-filter Scaled up replica set el-cel-eventlistener-no-filter-86584dc8cd to 1 default 2m34s Normal ScalingReplicaSet deployment/el-cel-eventlistener-no-filter Scaled up replica set el-cel-eventlistener-no-filter-86584dc8cd to 1 default 2m39s Warning FailedCreate replicaset/el-cel-listener-interceptor-5d5c7b6c45 Error creating: pods "el-cel-listener-interceptor-5d5c7b6c45-" is forbidden: error looking up service account default/tekton-triggers-example-sa: serviceaccount "tekton-triggers-example-sa" not found default 2m28s Warning FailedCreate replicaset/el-cel-listener-interceptor-5d5c7b6c45 Error creating: pods "el-cel-listener-interceptor-5d5c7b6c45-" is forbidden: error looking up service account default/tekton-triggers-example-sa: serviceaccount "tekton-triggers-example-sa" not found default 2m38s Warning FailedCreate replicaset/el-cel-listener-interceptor-with-secret-comparison-8548b984dc Error creating: pods "el-cel-listener-interceptor-with-secret-comparison-8548b984dc-" is forbidden: error looking up service account default/tekton-triggers-example-sa: serviceaccount "tekton-triggers-example-sa" not found default 2m29s Warning FailedCreate replicaset/el-cel-listener-interceptor-with-secret-comparison-8548b984dc Error creating: pods "el-cel-listener-interceptor-with-secret-comparison-8548b984dc-" is forbidden: error looking up service account default/tekton-triggers-example-sa: serviceaccount "tekton-triggers-example-sa" not found default 2m42s Normal ScalingReplicaSet deployment/el-cel-listener-interceptor-with-secret-comparison Scaled up replica set el-cel-listener-interceptor-with-secret-comparison-8548b984dc to 1 default 2m35s Normal ScalingReplicaSet deployment/el-cel-listener-interceptor-with-secret-comparison Scaled up replica set el-cel-listener-interceptor-with-secret-comparison-8548b984dc to 1 default 2m42s Normal ScalingReplicaSet deployment/el-cel-listener-interceptor Scaled up replica set el-cel-listener-interceptor-5d5c7b6c45 to 1 default 2m34s Normal ScalingReplicaSet deployment/el-cel-listener-interceptor Scaled up replica set el-cel-listener-interceptor-5d5c7b6c45 to 1 default 2m38s Warning FailedCreate replicaset/el-example-with-multiple-overlays-789f957494 Error creating: pods "el-example-with-multiple-overlays-789f957494-" is forbidden: error looking up service account default/tekton-triggers-example-sa: serviceaccount "tekton-triggers-example-sa" not found default 2m28s Warning FailedCreate replicaset/el-example-with-multiple-overlays-789f957494 Error creating: pods "el-example-with-multiple-overlays-789f957494-" is forbidden: error looking up service account default/tekton-triggers-example-sa: serviceaccount "tekton-triggers-example-sa" not found default 2m41s Normal ScalingReplicaSet deployment/el-example-with-multiple-overlays Scaled up replica set el-example-with-multiple-overlays-789f957494 to 1 default 2m34s Normal ScalingReplicaSet deployment/el-example-with-multiple-overlays Scaled up replica set el-example-with-multiple-overlays-789f957494 to 1 default 2m9s Normal Scheduled pod/el-ingress-test-eventlistener-657fdddc5f-7pk4v Successfully assigned default/el-ingress-test-eventlistener-657fdddc5f-7pk4v to gke-ttriggers-e2e-cls188-default-pool-ce5d49fc-2454 default 2m8s Normal Pulling pod/el-ingress-test-eventlistener-657fdddc5f-7pk4v Pulling image "gcr.io/tekton-prow-0/ttriggers-e2e-img/eventlistenersink-7ad1faa98cddbcb0c24990303b220bb8@sha256:875d785e81054cef48646863e1134e27c7e849aa9599f49b955c7cee0c456ccf" default 2m6s Normal Pulled pod/el-ingress-test-eventlistener-657fdddc5f-7pk4v Successfully pulled image "gcr.io/tekton-prow-0/ttriggers-e2e-img/eventlistenersink-7ad1faa98cddbcb0c24990303b220bb8@sha256:875d785e81054cef48646863e1134e27c7e849aa9599f49b955c7cee0c456ccf" in 2.257s (2.257s including waiting). Image size: 35531462 bytes. default 2m6s Normal Created pod/el-ingress-test-eventlistener-657fdddc5f-7pk4v Created container event-listener default 2m5s Normal Started pod/el-ingress-test-eventlistener-657fdddc5f-7pk4v Started container event-listener default 113s Normal Killing pod/el-ingress-test-eventlistener-657fdddc5f-7pk4v Stopping container event-listener default 2m9s Normal SuccessfulCreate replicaset/el-ingress-test-eventlistener-657fdddc5f Created pod: el-ingress-test-eventlistener-657fdddc5f-7pk4v default 2m9s Normal ScalingReplicaSet deployment/el-ingress-test-eventlistener Scaled up replica set el-ingress-test-eventlistener-657fdddc5f to 1 default 113s Normal Sync ingress/el-ingress-test-eventlistener Scheduled for sync default 97s Warning Sync ingress/el-ingress-test-eventlistener Error syncing to GCP: error running backend syncing routine: error ensuring health check: Error getting prober: unable to find nodeport {default/el-ingress-test-eventlistener/&ServiceBackendPort{Name:,Number:8080,} 0 8080 http-listener HTTP {0 8080 } true false false false false {false {false false false false}} <nil> 0xc0002da3c0 <nil> <nil>} in any service default 2m37s Warning FailedCreate replicaset/el-listener-7c8f9c8d48 Error creating: pods "el-listener-7c8f9c8d48-" is forbidden: error looking up service account default/tekton-triggers-example-sa: serviceaccount "tekton-triggers-example-sa" not found default 2m26s Warning FailedCreate replicaset/el-listener-7c8f9c8d48 Error creating: pods "el-listener-7c8f9c8d48-" is forbidden: error looking up service account default/tekton-triggers-example-sa: serviceaccount "tekton-triggers-example-sa" not found default 2m38s Warning FailedCreate replicaset/el-listener-clustertriggerbinding-cc76cdcc8 Error creating: pods "el-listener-clustertriggerbinding-cc76cdcc8-" is forbidden: error looking up service account default/tekton-triggers-example-sa: serviceaccount "tekton-triggers-example-sa" not found default 2m29s Warning FailedCreate replicaset/el-listener-clustertriggerbinding-cc76cdcc8 Error creating: pods "el-listener-clustertriggerbinding-cc76cdcc8-" is forbidden: error looking up service account default/tekton-triggers-example-sa: serviceaccount "tekton-triggers-example-sa" not found default 2m41s Normal ScalingReplicaSet deployment/el-listener-clustertriggerbinding Scaled up replica set el-listener-clustertriggerbinding-cc76cdcc8 to 1 default 2m34s Normal ScalingReplicaSet deployment/el-listener-clustertriggerbinding Scaled up replica set el-listener-clustertriggerbinding-cc76cdcc8 to 1 default 2m37s Warning FailedCreate replicaset/el-listener-interceptor-86dfd6b758 Error creating: pods "el-listener-interceptor-86dfd6b758-" is forbidden: error looking up service account default/tekton-triggers-example-sa: serviceaccount "tekton-triggers-example-sa" not found default 2m28s Warning FailedCreate replicaset/el-listener-interceptor-86dfd6b758 Error creating: pods "el-listener-interceptor-86dfd6b758-" is forbidden: error looking up service account default/tekton-triggers-example-sa: serviceaccount "tekton-triggers-example-sa" not found default 2m40s Normal ScalingReplicaSet deployment/el-listener-interceptor Scaled up replica set el-listener-interceptor-86dfd6b758 to 1 default 2m33s Normal ScalingReplicaSet deployment/el-listener-interceptor Scaled up replica set el-listener-interceptor-86dfd6b758 to 1 default 2m28s Warning FailedCreate replicaset/el-listener-loadbalancerclass-6566d47655 Error creating: pods "el-listener-loadbalancerclass-6566d47655-" is forbidden: error looking up service account default/tekton-triggers-example-sa: serviceaccount "tekton-triggers-example-sa" not found default 2m32s Normal ScalingReplicaSet deployment/el-listener-loadbalancerclass Scaled up replica set el-listener-loadbalancerclass-6566d47655 to 1 default 2m37s Warning FailedCreate replicaset/el-listener-multiinterceptor-6656fdc4bc Error creating: pods "el-listener-multiinterceptor-6656fdc4bc-" is forbidden: error looking up service account default/tekton-triggers-example-sa: serviceaccount "tekton-triggers-example-sa" not found default 2m27s Warning FailedCreate replicaset/el-listener-multiinterceptor-6656fdc4bc Error creating: pods "el-listener-multiinterceptor-6656fdc4bc-" is forbidden: error looking up service account default/tekton-triggers-example-sa: serviceaccount "tekton-triggers-example-sa" not found default 2m40s Normal ScalingReplicaSet deployment/el-listener-multiinterceptor Scaled up replica set el-listener-multiinterceptor-6656fdc4bc to 1 default 2m32s Normal ScalingReplicaSet deployment/el-listener-multiinterceptor Scaled up replica set el-listener-multiinterceptor-6656fdc4bc to 1 default 2m37s Warning FailedCreate replicaset/el-listener-podtemplate-647869fffb Error creating: pods "el-listener-podtemplate-647869fffb-" is forbidden: error looking up service account default/tekton-triggers-example-sa: serviceaccount "tekton-triggers-example-sa" not found default 2m28s Warning FailedCreate replicaset/el-listener-podtemplate-647869fffb Error creating: pods "el-listener-podtemplate-647869fffb-" is forbidden: error looking up service account default/tekton-triggers-example-sa: serviceaccount "tekton-triggers-example-sa" not found default 2m29s Warning FailedCreate replicaset/el-listener-podtemplate-6c76dd4c66 Error creating: pods "el-listener-podtemplate-6c76dd4c66-" is forbidden: error looking up service account default/tekton-triggers-example-sa: serviceaccount "tekton-triggers-example-sa" not found default 2m39s Normal ScalingReplicaSet deployment/el-listener-podtemplate Scaled up replica set el-listener-podtemplate-647869fffb to 1 default 2m34s Normal ScalingReplicaSet deployment/el-listener-podtemplate Scaled up replica set el-listener-podtemplate-6c76dd4c66 to 1 default 2m30s Normal ScalingReplicaSet deployment/el-listener-podtemplate Scaled up replica set el-listener-podtemplate-647869fffb to 1 default 2m37s Warning FailedCreate replicaset/el-listener-replicas-7bbf5cc9b4 Error creating: pods "el-listener-replicas-7bbf5cc9b4-" is forbidden: error looking up service account default/tekton-triggers-example-sa: serviceaccount "tekton-triggers-example-sa" not found default 2m27s Warning FailedCreate replicaset/el-listener-replicas-7bbf5cc9b4 Error creating: pods "el-listener-replicas-7bbf5cc9b4-" is forbidden: error looking up service account default/tekton-triggers-example-sa: serviceaccount "tekton-triggers-example-sa" not found default 2m39s Normal ScalingReplicaSet deployment/el-listener-replicas Scaled up replica set el-listener-replicas-7bbf5cc9b4 to 3 default 2m29s Normal ScalingReplicaSet deployment/el-listener-replicas Scaled up replica set el-listener-replicas-7bbf5cc9b4 to 3 default 2m27s Warning FailedCreate replicaset/el-listener-serviceconfig-776fc987b Error creating: pods "el-listener-serviceconfig-776fc987b-" is forbidden: error looking up service account default/tekton-triggers-example-sa: serviceaccount "tekton-triggers-example-sa" not found default 2m26s Warning FailedCreate replicaset/el-listener-serviceconfig-776fc987b Error creating: pods "el-listener-serviceconfig-776fc987b-" is forbidden: error looking up service account default/tekton-triggers-example-sa: serviceaccount "tekton-triggers-example-sa" not found default 2m29s Normal ScalingReplicaSet deployment/el-listener-serviceconfig Scaled up replica set el-listener-serviceconfig-776fc987b to 1 default 2m29s Normal EnsuringLoadBalancer service/el-listener-serviceconfig Ensuring load balancer default 2m26s Normal ScalingReplicaSet deployment/el-listener-serviceconfig Scaled up replica set el-listener-serviceconfig-776fc987b to 1 default 117s Normal EnsuredLoadBalancer service/el-listener-serviceconfig Ensured load balancer default 117s Normal DeletingLoadBalancer service/el-listener-serviceconfig Deleting load balancer default 88s Normal DeletedLoadBalancer service/el-listener-serviceconfig Deleted load balancer default 2m37s Warning FailedCreate replicaset/el-listener-tolerations-8658dddc5d Error creating: pods "el-listener-tolerations-8658dddc5d-" is forbidden: error looking up service account default/tekton-triggers-example-sa: serviceaccount "tekton-triggers-example-sa" not found default 2m27s Warning FailedCreate replicaset/el-listener-tolerations-8658dddc5d Error creating: pods "el-listener-tolerations-8658dddc5d-" is forbidden: error looking up service account default/tekton-triggers-example-sa: serviceaccount "tekton-triggers-example-sa" not found default 2m39s Normal ScalingReplicaSet deployment/el-listener-tolerations Scaled up replica set el-listener-tolerations-8658dddc5d to 1 default 2m29s Normal ScalingReplicaSet deployment/el-listener-tolerations Scaled up replica set el-listener-tolerations-8658dddc5d to 1 default 2m38s Normal ScalingReplicaSet deployment/el-listener Scaled up replica set el-listener-7c8f9c8d48 to 1 default 2m29s Normal ScalingReplicaSet deployment/el-listener Scaled up replica set el-listener-7c8f9c8d48 to 1 default 2m34s Warning InternalError eventlistener/example-with-multiple-overlays Operation cannot be fulfilled on deployments.apps "el-example-with-multiple-overlays": the object has been modified; please apply your changes to the latest version and try again default 9m41s Normal Starting node/gke-ttriggers-e2e-cls188-default-pool-696ba6a0-w32m Starting kubelet. ... skipping 40 lines ... default 2m25s Warning NodeRegistrationCheckerDidNotRunChecks node/gke-ttriggers-e2e-cls188-default-pool-ce5d49fc-2454 Wed Feb 5 09:42:33 UTC 2025 - ** Node ready and registered. ** default 2m8s Warning InternalError eventlistener/ingress-test-eventlistener Operation cannot be fulfilled on deployments.apps "el-ingress-test-eventlistener": the object has been modified; please apply your changes to the latest version and try again default 2m34s Warning InternalError eventlistener/listener-clustertriggerbinding Operation cannot be fulfilled on deployments.apps "el-listener-clustertriggerbinding": the object has been modified; please apply your changes to the latest version and try again default 2m39s Warning InternalError eventlistener/listener-interceptor Operation cannot be fulfilled on deployments.apps "el-listener-interceptor": the object has been modified; please apply your changes to the latest version and try again default 2m31s Warning InternalError eventlistener/listener-loadbalancerclass Operation cannot be fulfilled on deployments.apps "el-listener-loadbalancerclass": the object has been modified; please apply your changes to the latest version and try again default 2m39s Warning InternalError eventlistener/listener-multiinterceptor Operation cannot be fulfilled on deployments.apps "el-listener-multiinterceptor": the object has been modified; please apply your changes to the latest version and try again default 2m38s Warning UpdateFailed eventlistener/listener-multiinterceptor Failed to update status for "listener-multiinterceptor": eventlisteners.triggers.tekton.dev "listener-multiinterceptor" not found default 2m39s Warning InternalError eventlistener/listener-podtemplate Operation cannot be fulfilled on deployments.apps "el-listener-podtemplate": the object has been modified; please apply your changes to the latest version and try again default 2m29s Warning InternalError eventlistener/listener-replicas Operation cannot be fulfilled on deployments.apps "el-listener-replicas": the object has been modified; please apply your changes to the latest version and try again default 2m28s Warning InternalError eventlistener/listener-serviceconfig Operation cannot be fulfilled on deployments.apps "el-listener-serviceconfig": the object has been modified; please apply your changes to the latest version and try again default 2m26s Warning UpdateFailed eventlistener/listener-serviceconfig Failed to update status for "listener-serviceconfig": eventlisteners.triggers.tekton.dev "listener-serviceconfig" not found default 2m38s Warning InternalError eventlistener/listener-tolerations Operation cannot be fulfilled on deployments.apps "el-listener-tolerations": the object has been modified; please apply your changes to the latest version and try again default 2m37s Warning UpdateFailed eventlistener/listener Failed to update status for "listener": eventlisteners.triggers.tekton.dev "listener" not found gke-managed-cim 5m21s Warning FailedScheduling pod/kube-state-metrics-0 no nodes available to schedule pods gke-managed-cim 5m11s Warning FailedScheduling pod/kube-state-metrics-0 0/3 nodes are available: 1 node(s) had untolerated taint {node.kubernetes.io/not-ready: }, 2 node(s) had untolerated taint {node.cloudprovider.kubernetes.io/uninitialized: true}. preemption: 0/3 nodes are available: 3 Preemption is not helpful for scheduling. gke-managed-cim 4m51s Normal Scheduled pod/kube-state-metrics-0 Successfully assigned gke-managed-cim/kube-state-metrics-0 to gke-ttriggers-e2e-cls188-default-pool-a93c56c2-trb3 gke-managed-cim 4m51s Normal Pulling pod/kube-state-metrics-0 Pulling image "us-central1-artifactregistry.gcr.io/gke-release/gke-release/kube-state-metrics:v2.7.0-gke.70@sha256:ccc1ac9df886d2d0d2e745505fee40b1eabd7ec264e279bdd5de50e5ad0f28d6" gke-managed-cim 4m49s Normal Pulled pod/kube-state-metrics-0 Successfully pulled image "us-central1-artifactregistry.gcr.io/gke-release/gke-release/kube-state-metrics:v2.7.0-gke.70@sha256:ccc1ac9df886d2d0d2e745505fee40b1eabd7ec264e279bdd5de50e5ad0f28d6" in 1.718s (1.718s including waiting). Image size: 12821750 bytes. gke-managed-cim 4m49s Normal Created pod/kube-state-metrics-0 Created container kube-state-metrics gke-managed-cim 4m49s Normal Started pod/kube-state-metrics-0 Started container kube-state-metrics gke-managed-cim 4m49s Normal Pulling pod/kube-state-metrics-0 Pulling image "us-central1-artifactregistry.gcr.io/gke-release/gke-release/gke-metrics-collector:20240501_2300_RC0@sha256:af727fbef6a16960bd3541d89b94e1a4938b57041e5869f148995d8c271a6334" gke-managed-cim 4m43s Normal Pulled pod/kube-state-metrics-0 Successfully pulled image "us-central1-artifactregistry.gcr.io/gke-release/gke-release/gke-metrics-collector:20240501_2300_RC0@sha256:af727fbef6a16960bd3541d89b94e1a4938b57041e5869f148995d8c271a6334" in 1.372s (5.347s including waiting). Image size: 23786769 bytes. gke-managed-cim 4m43s Normal Created pod/kube-state-metrics-0 Created container ksm-metrics-collector gke-managed-cim 4m43s Normal Started pod/kube-state-metrics-0 Started container ksm-metrics-collector gke-managed-cim 6m16s Warning FailedCreate statefulset/kube-state-metrics create Pod kube-state-metrics-0 in StatefulSet kube-state-metrics failed error: pods "kube-state-metrics-0" is forbidden: error looking up service account gke-managed-cim/kube-state-metrics: serviceaccount "kube-state-metrics" not found gke-managed-cim 6m16s Normal SuccessfulCreate statefulset/kube-state-metrics create Pod kube-state-metrics-0 in StatefulSet kube-state-metrics successful gke-managed-cim 4m2s Warning FailedGetResourceMetric horizontalpodautoscaler/kube-state-metrics unable to get metric memory: unable to fetch metrics from resource metrics API: the server is currently unable to handle the request (get pods.metrics.k8s.io) gke-managed-cim 3m47s Warning FailedGetResourceMetric horizontalpodautoscaler/kube-state-metrics unable to get metric memory: no metrics returned from resource metrics API gke-managed-volumepopulator 5m58s Normal LeaderElection lease/gke-volume-populator-leader gke-586f2c74df224f5da58b-52d1-60c2-vm became leader gmp-system 5m18s Warning FailedScheduling pod/alertmanager-0 no nodes available to schedule pods gmp-system 5m7s Warning FailedScheduling pod/alertmanager-0 0/3 nodes are available: 3 node(s) had untolerated taint {node.kubernetes.io/not-ready: }. preemption: 0/3 nodes are available: 3 Preemption is not helpful for scheduling. gmp-system 4m51s Normal Scheduled pod/alertmanager-0 Successfully assigned gmp-system/alertmanager-0 to gke-ttriggers-e2e-cls188-default-pool-a93c56c2-trb3 gmp-system 4m44s Warning FailedMount pod/alertmanager-0 MountVolume.SetUp failed for volume "config" : secret "alertmanager" not found gmp-system 5m43s Normal SuccessfulCreate statefulset/alertmanager create Pod alertmanager-0 in StatefulSet alertmanager successful gmp-system 4m44s Normal SuccessfulDelete statefulset/alertmanager delete Pod alertmanager-0 in StatefulSet alertmanager successful gmp-system 5m Warning NetworkNotReady pod/collector-54s4d network is not ready: container runtime network not ready: NetworkReady=false reason:NetworkPluginNotReady message:Network plugin returns error: cni plugin not initialized gmp-system 5m10s Normal Scheduled pod/collector-54s4d Successfully assigned gmp-system/collector-54s4d to gke-ttriggers-e2e-cls188-default-pool-ce5d49fc-2454 gmp-system 5m2s Warning FailedMount pod/collector-54s4d MountVolume.SetUp failed for volume "config" : object "gmp-system"/"collector" not registered gmp-system 5m2s Warning FailedMount pod/collector-54s4d MountVolume.SetUp failed for volume "collection-secret" : object "gmp-system"/"collection" not registered gmp-system 5m2s Warning FailedMount pod/collector-54s4d MountVolume.SetUp failed for volume "kube-api-access-5qmp5" : object "gmp-system"/"kube-root-ca.crt" not registered gmp-system 4m54s Warning FailedMount pod/collector-54s4d MountVolume.SetUp failed for volume "collection-secret" : secret "collection" not found gmp-system 4m54s Warning FailedMount pod/collector-54s4d MountVolume.SetUp failed for volume "config" : configmap "collector" not found gmp-system 4m37s Normal Pulling pod/collector-54s4d Pulling image "us-central1-artifactregistry.gcr.io/gke-release/gke-release/gke-distroless/bash:gke_distroless_20240907.00_p0@sha256:ff5d5abcc0cdd74d3ba43b0959b246c4432c14356b1414ce35d8feff820eb664" gmp-system 4m36s Normal Pulled pod/collector-54s4d Successfully pulled image "us-central1-artifactregistry.gcr.io/gke-release/gke-release/gke-distroless/bash:gke_distroless_20240907.00_p0@sha256:ff5d5abcc0cdd74d3ba43b0959b246c4432c14356b1414ce35d8feff820eb664" in 1.228s (1.228s including waiting). Image size: 18373482 bytes. gmp-system 4m57s Warning NetworkNotReady pod/collector-hj78v network is not ready: container runtime network not ready: NetworkReady=false reason:NetworkPluginNotReady message:Network plugin returns error: cni plugin not initialized gmp-system 5m9s Normal Scheduled pod/collector-hj78v Successfully assigned gmp-system/collector-hj78v to gke-ttriggers-e2e-cls188-default-pool-696ba6a0-w32m gmp-system 5m1s Warning FailedMount pod/collector-hj78v MountVolume.SetUp failed for volume "config" : object "gmp-system"/"collector" not registered gmp-system 5m1s Warning FailedMount pod/collector-hj78v MountVolume.SetUp failed for volume "collection-secret" : object "gmp-system"/"collection" not registered gmp-system 5m1s Warning FailedMount pod/collector-hj78v MountVolume.SetUp failed for volume "kube-api-access-b24v6" : object "gmp-system"/"kube-root-ca.crt" not registered gmp-system 4m53s Warning FailedMount pod/collector-hj78v MountVolume.SetUp failed for volume "collection-secret" : secret "collection" not found gmp-system 4m53s Warning FailedMount pod/collector-hj78v MountVolume.SetUp failed for volume "config" : configmap "collector" not found gmp-system 4m37s Normal Pulling pod/collector-hj78v Pulling image "us-central1-artifactregistry.gcr.io/gke-release/gke-release/gke-distroless/bash:gke_distroless_20240907.00_p0@sha256:ff5d5abcc0cdd74d3ba43b0959b246c4432c14356b1414ce35d8feff820eb664" gmp-system 5m Warning NetworkNotReady pod/collector-msljq network is not ready: container runtime network not ready: NetworkReady=false reason:NetworkPluginNotReady message:Network plugin returns error: cni plugin not initialized gmp-system 5m12s Normal Scheduled pod/collector-msljq Successfully assigned gmp-system/collector-msljq to gke-ttriggers-e2e-cls188-default-pool-a93c56c2-trb3 gmp-system 5m4s Warning FailedMount pod/collector-msljq MountVolume.SetUp failed for volume "config" : object "gmp-system"/"collector" not registered gmp-system 5m4s Warning FailedMount pod/collector-msljq MountVolume.SetUp failed for volume "collection-secret" : object "gmp-system"/"collection" not registered gmp-system 5m4s Warning FailedMount pod/collector-msljq MountVolume.SetUp failed for volume "kube-api-access-7f4wf" : object "gmp-system"/"kube-root-ca.crt" not registered gmp-system 4m56s Warning FailedMount pod/collector-msljq MountVolume.SetUp failed for volume "collection-secret" : secret "collection" not found gmp-system 4m56s Warning FailedMount pod/collector-msljq MountVolume.SetUp failed for volume "config" : configmap "collector" not found gmp-system 4m39s Normal Pulling pod/collector-msljq Pulling image "us-central1-artifactregistry.gcr.io/gke-release/gke-release/gke-distroless/bash:gke_distroless_20240907.00_p0@sha256:ff5d5abcc0cdd74d3ba43b0959b246c4432c14356b1414ce35d8feff820eb664" gmp-system 5m12s Normal SuccessfulCreate daemonset/collector Created pod: collector-msljq gmp-system 5m10s Normal SuccessfulCreate daemonset/collector Created pod: collector-54s4d gmp-system 5m9s Normal SuccessfulCreate daemonset/collector Created pod: collector-hj78v gmp-system 5m19s Warning FailedScheduling pod/gmp-operator-867965f8dd-sj6x4 no nodes available to schedule pods gmp-system 5m8s Warning FailedScheduling pod/gmp-operator-867965f8dd-sj6x4 0/3 nodes are available: 3 node(s) had untolerated taint {node.kubernetes.io/not-ready: }. preemption: 0/3 nodes are available: 3 Preemption is not helpful for scheduling. ... skipping 4 lines ... gmp-system 4m44s Normal Started pod/gmp-operator-867965f8dd-sj6x4 Started container operator gmp-system 5m44s Normal SuccessfulCreate replicaset/gmp-operator-867965f8dd Created pod: gmp-operator-867965f8dd-sj6x4 gmp-system 5m44s Normal ScalingReplicaSet deployment/gmp-operator Scaled up replica set gmp-operator-867965f8dd to 1 gmp-system 5m18s Warning FailedScheduling pod/rule-evaluator-858df77cc7-spr9p no nodes available to schedule pods gmp-system 5m8s Warning FailedScheduling pod/rule-evaluator-858df77cc7-spr9p 0/3 nodes are available: 3 node(s) had untolerated taint {node.kubernetes.io/not-ready: }. preemption: 0/3 nodes are available: 3 Preemption is not helpful for scheduling. gmp-system 4m51s Normal Scheduled pod/rule-evaluator-858df77cc7-spr9p Successfully assigned gmp-system/rule-evaluator-858df77cc7-spr9p to gke-ttriggers-e2e-cls188-default-pool-a93c56c2-trb3 gmp-system 4m44s Warning FailedMount pod/rule-evaluator-858df77cc7-spr9p MountVolume.SetUp failed for volume "rules-secret" : secret "rules" not found gmp-system 4m48s Warning FailedMount pod/rule-evaluator-858df77cc7-spr9p MountVolume.SetUp failed for volume "rules" : configmap "rules-generated" not found gmp-system 4m44s Warning FailedMount pod/rule-evaluator-858df77cc7-spr9p MountVolume.SetUp failed for volume "config" : configmap "rule-evaluator" not found gmp-system 5m44s Normal SuccessfulCreate replicaset/rule-evaluator-858df77cc7 Created pod: rule-evaluator-858df77cc7-spr9p gmp-system 4m44s Normal SuccessfulDelete replicaset/rule-evaluator-858df77cc7 Deleted pod: rule-evaluator-858df77cc7-spr9p gmp-system 5m44s Normal ScalingReplicaSet deployment/rule-evaluator Scaled up replica set rule-evaluator-858df77cc7 to 1 gmp-system 4m44s Normal ScalingReplicaSet deployment/rule-evaluator Scaled down replica set rule-evaluator-858df77cc7 to 0 from 1 knative-serving 41s Normal Scheduled pod/activator-64c59c9978-tm2pk Successfully assigned knative-serving/activator-64c59c9978-tm2pk to gke-ttriggers-e2e-cls188-default-pool-ce5d49fc-2454 knative-serving 41s Normal Pulling pod/activator-64c59c9978-tm2pk Pulling image "gcr.io/knative-releases/knative.dev/serving/cmd/activator@sha256:c2994c2b6c2c7f38ad1b85c71789bf1753cc8979926423c83231e62258837cb9" knative-serving 37s Normal Pulled pod/activator-64c59c9978-tm2pk Successfully pulled image "gcr.io/knative-releases/knative.dev/serving/cmd/activator@sha256:c2994c2b6c2c7f38ad1b85c71789bf1753cc8979926423c83231e62258837cb9" in 3.206s (3.206s including waiting). Image size: 17569721 bytes. knative-serving 37s Normal Created pod/activator-64c59c9978-tm2pk Created container activator knative-serving 37s Normal Started pod/activator-64c59c9978-tm2pk Started container activator knative-serving 37s Warning Unhealthy pod/activator-64c59c9978-tm2pk Readiness probe failed: Get "http://10.72.2.10:8012/": dial tcp 10.72.2.10:8012: connect: connection refused knative-serving 31s Warning Unhealthy pod/activator-64c59c9978-tm2pk Readiness probe failed: HTTP probe failed with statuscode: 500 knative-serving 41s Normal SuccessfulCreate replicaset/activator-64c59c9978 Created pod: activator-64c59c9978-tm2pk knative-serving 42s Normal NoPods poddisruptionbudget/activator-pdb No matching pods found knative-serving 42s Normal ScalingReplicaSet deployment/activator Scaled up replica set activator-64c59c9978 to 1 knative-serving 1s Warning FailedGetResourceMetric horizontalpodautoscaler/activator No recommendation knative-serving 41s Normal Scheduled pod/autoscaler-679bc68fbf-fdjmc Successfully assigned knative-serving/autoscaler-679bc68fbf-fdjmc to gke-ttriggers-e2e-cls188-default-pool-696ba6a0-w32m knative-serving 41s Normal Pulling pod/autoscaler-679bc68fbf-fdjmc Pulling image "gcr.io/knative-releases/knative.dev/serving/cmd/autoscaler@sha256:8319aa662b4912e8175018bd7cc90c63838562a27515197b803bdcd5634c7007" knative-serving 37s Normal Pulled pod/autoscaler-679bc68fbf-fdjmc Successfully pulled image "gcr.io/knative-releases/knative.dev/serving/cmd/autoscaler@sha256:8319aa662b4912e8175018bd7cc90c63838562a27515197b803bdcd5634c7007" in 3.181s (3.181s including waiting). Image size: 17817186 bytes. knative-serving 37s Normal Created pod/autoscaler-679bc68fbf-fdjmc Created container autoscaler knative-serving 37s Normal Started pod/autoscaler-679bc68fbf-fdjmc Started container autoscaler knative-serving 37s Warning Unhealthy pod/autoscaler-679bc68fbf-fdjmc Readiness probe failed: Get "http://10.72.0.13:8080/": dial tcp 10.72.0.13:8080: connect: connection refused knative-serving 41s Normal SuccessfulCreate replicaset/autoscaler-679bc68fbf Created pod: autoscaler-679bc68fbf-fdjmc knative-serving 41s Normal ScalingReplicaSet deployment/autoscaler Scaled up replica set autoscaler-679bc68fbf to 1 knative-serving 40s Normal Scheduled pod/controller-665646655f-m7nrm Successfully assigned knative-serving/controller-665646655f-m7nrm to gke-ttriggers-e2e-cls188-default-pool-696ba6a0-w32m knative-serving 39s Normal Pulling pod/controller-665646655f-m7nrm Pulling image "gcr.io/knative-releases/knative.dev/serving/cmd/controller@sha256:98a2cc7fd62ee95e137116504e7166c32c65efef42c3d1454630780410abf943" knative-serving 36s Normal Pulled pod/controller-665646655f-m7nrm Successfully pulled image "gcr.io/knative-releases/knative.dev/serving/cmd/controller@sha256:98a2cc7fd62ee95e137116504e7166c32c65efef42c3d1454630780410abf943" in 2.733s (2.733s including waiting). Image size: 19626853 bytes. knative-serving 36s Normal Created pod/controller-665646655f-m7nrm Created container controller knative-serving 36s Normal Started pod/controller-665646655f-m7nrm Started container controller knative-serving 36s Warning Unhealthy pod/controller-665646655f-m7nrm Readiness probe failed: Get "http://10.72.0.14:8080/readiness": dial tcp 10.72.0.14:8080: connect: connection refused knative-serving 40s Normal SuccessfulCreate replicaset/controller-665646655f Created pod: controller-665646655f-m7nrm knative-serving 41s Normal ScalingReplicaSet deployment/controller Scaled up replica set controller-665646655f to 1 knative-serving 40s Normal Scheduled pod/domain-mapping-5d89b5d688-nc28k Successfully assigned knative-serving/domain-mapping-5d89b5d688-nc28k to gke-ttriggers-e2e-cls188-default-pool-a93c56c2-trb3 knative-serving 39s Normal Pulling pod/domain-mapping-5d89b5d688-nc28k Pulling image "gcr.io/knative-releases/knative.dev/serving/cmd/domain-mapping@sha256:f66c41ad7a73f5d4f4bdfec4294d5459c477f09f3ce52934d1a215e32316b59b" knative-serving 36s Normal Pulled pod/domain-mapping-5d89b5d688-nc28k Successfully pulled image "gcr.io/knative-releases/knative.dev/serving/cmd/domain-mapping@sha256:f66c41ad7a73f5d4f4bdfec4294d5459c477f09f3ce52934d1a215e32316b59b" in 2.732s (2.732s including waiting). Image size: 17442657 bytes. knative-serving 36s Normal Created pod/domain-mapping-5d89b5d688-nc28k Created container domain-mapping knative-serving 36s Normal Started pod/domain-mapping-5d89b5d688-nc28k Started container domain-mapping knative-serving 36s Warning Unhealthy pod/domain-mapping-5d89b5d688-nc28k Readiness probe failed: Get "http://10.72.1.15:8080/readiness": dial tcp 10.72.1.15:8080: connect: connection refused knative-serving 40s Normal SuccessfulCreate replicaset/domain-mapping-5d89b5d688 Created pod: domain-mapping-5d89b5d688-nc28k knative-serving 41s Normal ScalingReplicaSet deployment/domain-mapping Scaled up replica set domain-mapping-5d89b5d688 to 1 knative-serving 39s Normal Scheduled pod/domainmapping-webhook-6948657854-pzrmz Successfully assigned knative-serving/domainmapping-webhook-6948657854-pzrmz to gke-ttriggers-e2e-cls188-default-pool-a93c56c2-trb3 knative-serving 39s Normal Pulling pod/domainmapping-webhook-6948657854-pzrmz Pulling image "gcr.io/knative-releases/knative.dev/serving/cmd/domain-mapping-webhook@sha256:7368aaddf2be8d8784dc7195f5bc272ecfe49d429697f48de0ddc44f278167aa" knative-serving 36s Normal Pulled pod/domainmapping-webhook-6948657854-pzrmz Successfully pulled image "gcr.io/knative-releases/knative.dev/serving/cmd/domain-mapping-webhook@sha256:7368aaddf2be8d8784dc7195f5bc272ecfe49d429697f48de0ddc44f278167aa" in 3.118s (3.118s including waiting). Image size: 16939786 bytes. knative-serving 36s Normal Created pod/domainmapping-webhook-6948657854-pzrmz Created container domainmapping-webhook ... skipping 286 lines ... kube-system 4m51s Normal Scheduled pod/metrics-server-v1.31.0-6fc8f75fc5-dsslg Successfully assigned kube-system/metrics-server-v1.31.0-6fc8f75fc5-dsslg to gke-ttriggers-e2e-cls188-default-pool-a93c56c2-trb3 kube-system 4m51s Normal Pulling pod/metrics-server-v1.31.0-6fc8f75fc5-dsslg Pulling image "us-central1-artifactregistry.gcr.io/gke-release/gke-release/metrics-server:v0.7.1-gke.29@sha256:ec587ef93f337e0f189ac9d4ab01a72463ded394efce298112f50a90b92b77a8" kube-system 4m49s Normal Pulled pod/metrics-server-v1.31.0-6fc8f75fc5-dsslg Successfully pulled image "us-central1-artifactregistry.gcr.io/gke-release/gke-release/metrics-server:v0.7.1-gke.29@sha256:ec587ef93f337e0f189ac9d4ab01a72463ded394efce298112f50a90b92b77a8" in 1.792s (1.793s including waiting). Image size: 19257925 bytes. kube-system 4m49s Normal Created pod/metrics-server-v1.31.0-6fc8f75fc5-dsslg Created container metrics-server kube-system 4m49s Normal Started pod/metrics-server-v1.31.0-6fc8f75fc5-dsslg Started container metrics-server kube-system 3m50s Normal Killing pod/metrics-server-v1.31.0-6fc8f75fc5-dsslg Stopping container metrics-server kube-system 5m38s Warning FailedCreate replicaset/metrics-server-v1.31.0-6fc8f75fc5 Error creating: pods "metrics-server-v1.31.0-6fc8f75fc5-" is forbidden: error looking up service account kube-system/metrics-server: serviceaccount "metrics-server" not found kube-system 5m36s Normal SuccessfulCreate replicaset/metrics-server-v1.31.0-6fc8f75fc5 Created pod: metrics-server-v1.31.0-6fc8f75fc5-dsslg kube-system 3m51s Normal SuccessfulDelete replicaset/metrics-server-v1.31.0-6fc8f75fc5 Deleted pod: metrics-server-v1.31.0-6fc8f75fc5-dsslg kube-system 5m39s Normal ScalingReplicaSet deployment/metrics-server-v1.31.0 Scaled up replica set metrics-server-v1.31.0-6fc8f75fc5 to 1 kube-system 5m36s Normal ScalingReplicaSet deployment/metrics-server-v1.31.0 Scaled up replica set metrics-server-v1.31.0-5db6dbd8bc to 1 kube-system 3m51s Normal ScalingReplicaSet deployment/metrics-server-v1.31.0 Scaled down replica set metrics-server-v1.31.0-6fc8f75fc5 to 0 from 1 kube-system 5m31s Normal LeaderElection lease/pd-csi-storage-gke-io 1738748313676-2709-pd-csi-storage-gke-io became leader ... skipping 78 lines ... tekton-pipelines 3m3s Normal Pulled pod/tekton-triggers-webhook-6f9c5554df-2dgxl Successfully pulled image "gcr.io/tekton-prow-0/ttriggers-e2e-img/webhook-dd1edc925ee1772a9f76e2c1bc291ef6@sha256:81e001fe2b6d2c551f6acef1a85fb81d06ed5c08dd51d5b65f40820c7eb87fb8" in 2.327s (2.327s including waiting). Image size: 36091689 bytes. tekton-pipelines 3m3s Normal Created pod/tekton-triggers-webhook-6f9c5554df-2dgxl Created container webhook tekton-pipelines 3m3s Normal Started pod/tekton-triggers-webhook-6f9c5554df-2dgxl Started container webhook tekton-pipelines 3m6s Normal SuccessfulCreate replicaset/tekton-triggers-webhook-6f9c5554df Created pod: tekton-triggers-webhook-6f9c5554df-2dgxl tekton-pipelines 3m6s Normal ScalingReplicaSet deployment/tekton-triggers-webhook Scaled up replica set tekton-triggers-webhook-6f9c5554df to 1 *************************************** *** E2E TEST FAILED *** *** End of information dump *** *************************************** 2025/02/05 09:44:58 process.go:155: Step '/home/prow/go/src/github.com/tektoncd/triggers/test/e2e-tests.sh --run-tests' finished in 4m36.19891275s 2025/02/05 09:44:58 main.go:319: Something went wrong: encountered 1 errors: [error during /home/prow/go/src/github.com/tektoncd/triggers/test/e2e-tests.sh --run-tests: exit status 1] Forwarding from 127.0.0.1:8080 -> 8080 error: lost connection to pod Test subprocess exited with code 0 Artifacts were written to /logs/artifacts Test result code is 1 ================================== ==== INTEGRATION TESTS FAILED ==== ================================== + EXIT_VALUE=1 + set +o xtrace