ResultFAILURE
Tests 0 failed / 0 succeeded
Started2025-03-31 10:30
Elapsed12m3s
Revision55d6a6ce69eb92222954f991b48ad40d9ae37055
Refs 1820
E2E:Machinen1-standard-4
E2E:MaxNodes3
E2E:MinNodes1
E2E:Regionus-central1
E2E:Version1.31.6-gke.1020000

No Test Failures!


Error lines from build-log.txt

... skipping 376 lines ...
configmap/config-leader-election-triggers-webhook created
configmap/config-logging-triggers created
configmap/config-observability-triggers created
service/tekton-triggers-controller created
service/tekton-triggers-webhook created
deployment.apps/tekton-triggers-webhook created
Error: error processing import paths in "config/controller.yaml": error resolving image references: GET https://gcr.io/v2/token?scope=repository%3Atekton-prow-3%2Fttriggers-e2e-img%2Feventlistenersink-7ad1faa98cddbcb0c24990303b220bb8%3Apush%2Cpull&service=gcr.io: unexpected status code 412 Precondition Failed: Container Registry is deprecated and shutting down, please use the auto migration tool to migrate to Artifact Registry (gcloud artifacts docker upgrade migrate --projects='tekton-prow-3'). For more details see: https://cloud.google.com/artifact-registry/docs/transition/auto-migrate-gcr-ar
ERROR: Tekton Triggers installation failed
***************************************
***         E2E TEST FAILED         ***
***    Start of information dump    ***
***************************************
>>> All resources:
NAMESPACE                    NAME                                                                 READY   STATUS              RESTARTS   AGE
gke-managed-cim              pod/kube-state-metrics-0                                             2/2     Running             0          5m16s
gmp-system                   pod/collector-5kgst                                                  2/2     Running             0          4m8s
... skipping 176 lines ...
gke-managed-cim               3m48s       Normal    Created                                  pod/kube-state-metrics-0                                             Created container: kube-state-metrics
gke-managed-cim               3m48s       Normal    Started                                  pod/kube-state-metrics-0                                             Started container kube-state-metrics
gke-managed-cim               3m48s       Normal    Pulling                                  pod/kube-state-metrics-0                                             Pulling image "us-central1-artifactregistry.gcr.io/gke-release/gke-release/gke-metrics-collector:20240501_2300_RC0@sha256:af727fbef6a16960bd3541d89b94e1a4938b57041e5869f148995d8c271a6334"
gke-managed-cim               3m43s       Normal    Pulled                                   pod/kube-state-metrics-0                                             Successfully pulled image "us-central1-artifactregistry.gcr.io/gke-release/gke-release/gke-metrics-collector:20240501_2300_RC0@sha256:af727fbef6a16960bd3541d89b94e1a4938b57041e5869f148995d8c271a6334" in 1.676s (4.714s including waiting). Image size: 23786769 bytes.
gke-managed-cim               3m43s       Normal    Created                                  pod/kube-state-metrics-0                                             Created container: ksm-metrics-collector
gke-managed-cim               3m43s       Normal    Started                                  pod/kube-state-metrics-0                                             Started container ksm-metrics-collector
gke-managed-cim               5m17s       Warning   FailedCreate                             statefulset/kube-state-metrics                                       create Pod kube-state-metrics-0 in StatefulSet kube-state-metrics failed error: pods "kube-state-metrics-0" is forbidden: error looking up service account gke-managed-cim/kube-state-metrics: serviceaccount "kube-state-metrics" not found
gke-managed-cim               5m17s       Normal    SuccessfulCreate                         statefulset/kube-state-metrics                                       create Pod kube-state-metrics-0 in StatefulSet kube-state-metrics successful
gke-managed-cim               2m52s       Warning   FailedGetResourceMetric                  horizontalpodautoscaler/kube-state-metrics                           unable to get metric memory: unable to fetch metrics from resource metrics API: the server is currently unable to handle the request (get pods.metrics.k8s.io)
gke-managed-cim               2m10s       Warning   FailedGetResourceMetric                  horizontalpodautoscaler/kube-state-metrics                           unable to get metric memory: no metrics returned from resource metrics API
gke-managed-volumepopulator   4m58s       Normal    LeaderElection                           lease/gke-volume-populator-leader                                    gke-e57d40204f5141e5849c-8235-15dc-vm became leader
gmp-system                    4m44s       Warning   FailedScheduling                         pod/alertmanager-0                                                   no nodes available to schedule pods
gmp-system                    4m41s       Warning   FailedScheduling                         pod/alertmanager-0                                                   no nodes available to schedule pods
gmp-system                    3m50s       Normal    Scheduled                                pod/alertmanager-0                                                   Successfully assigned gmp-system/alertmanager-0 to gke-ttriggers-e2e-cls190-default-pool-f65a2cb6-km8q
gmp-system                    3m46s       Warning   FailedMount                              pod/alertmanager-0                                                   MountVolume.SetUp failed for volume "config" : secret "alertmanager" not found
gmp-system                    4m44s       Normal    SuccessfulCreate                         statefulset/alertmanager                                             create Pod alertmanager-0 in StatefulSet alertmanager successful
gmp-system                    3m44s       Normal    SuccessfulDelete                         statefulset/alertmanager                                             delete Pod alertmanager-0 in StatefulSet alertmanager successful
gmp-system                    3m57s       Warning   NetworkNotReady                          pod/collector-5kgst                                                  network is not ready: container runtime network not ready: NetworkReady=false reason:NetworkPluginNotReady message:Network plugin returns error: cni plugin not initialized
gmp-system                    4m8s        Normal    Scheduled                                pod/collector-5kgst                                                  Successfully assigned gmp-system/collector-5kgst to gke-ttriggers-e2e-cls190-default-pool-693569f5-sff6
gmp-system                    4m          Warning   FailedMount                              pod/collector-5kgst                                                  MountVolume.SetUp failed for volume "config" : object "gmp-system"/"collector" not registered
gmp-system                    4m          Warning   FailedMount                              pod/collector-5kgst                                                  MountVolume.SetUp failed for volume "collection-secret" : object "gmp-system"/"collection" not registered
gmp-system                    4m          Warning   FailedMount                              pod/collector-5kgst                                                  MountVolume.SetUp failed for volume "kube-api-access-s4vsk" : object "gmp-system"/"kube-root-ca.crt" not registered
gmp-system                    3m52s       Warning   FailedMount                              pod/collector-5kgst                                                  MountVolume.SetUp failed for volume "config" : configmap "collector" not found
gmp-system                    3m52s       Warning   FailedMount                              pod/collector-5kgst                                                  MountVolume.SetUp failed for volume "collection-secret" : secret "collection" not found
gmp-system                    3m36s       Normal    Pulling                                  pod/collector-5kgst                                                  Pulling image "us-central1-artifactregistry.gcr.io/gke-release/gke-release/gke-distroless/bash:gke_distroless_20240907.00_p0@sha256:ff5d5abcc0cdd74d3ba43b0959b246c4432c14356b1414ce35d8feff820eb664"
gmp-system                    4m10s       Normal    Scheduled                                pod/collector-nxgmb                                                  Successfully assigned gmp-system/collector-nxgmb to gke-ttriggers-e2e-cls190-default-pool-f65a2cb6-km8q
gmp-system                    4m          Warning   NetworkNotReady                          pod/collector-nxgmb                                                  network is not ready: container runtime network not ready: NetworkReady=false reason:NetworkPluginNotReady message:Network plugin returns error: cni plugin not initialized
gmp-system                    4m2s        Warning   FailedMount                              pod/collector-nxgmb                                                  MountVolume.SetUp failed for volume "collection-secret" : object "gmp-system"/"collection" not registered
gmp-system                    4m2s        Warning   FailedMount                              pod/collector-nxgmb                                                  MountVolume.SetUp failed for volume "config" : object "gmp-system"/"collector" not registered
gmp-system                    4m2s        Warning   FailedMount                              pod/collector-nxgmb                                                  MountVolume.SetUp failed for volume "kube-api-access-d869v" : object "gmp-system"/"kube-root-ca.crt" not registered
gmp-system                    3m54s       Warning   FailedMount                              pod/collector-nxgmb                                                  MountVolume.SetUp failed for volume "config" : configmap "collector" not found
gmp-system                    3m54s       Warning   FailedMount                              pod/collector-nxgmb                                                  MountVolume.SetUp failed for volume "collection-secret" : secret "collection" not found
gmp-system                    3m38s       Normal    Pulling                                  pod/collector-nxgmb                                                  Pulling image "us-central1-artifactregistry.gcr.io/gke-release/gke-release/gke-distroless/bash:gke_distroless_20240907.00_p0@sha256:ff5d5abcc0cdd74d3ba43b0959b246c4432c14356b1414ce35d8feff820eb664"
gmp-system                    3m37s       Normal    Pulled                                   pod/collector-nxgmb                                                  Successfully pulled image "us-central1-artifactregistry.gcr.io/gke-release/gke-release/gke-distroless/bash:gke_distroless_20240907.00_p0@sha256:ff5d5abcc0cdd74d3ba43b0959b246c4432c14356b1414ce35d8feff820eb664" in 644ms (644ms including waiting). Image size: 18373482 bytes.
gmp-system                    3m57s       Warning   NetworkNotReady                          pod/collector-w7vrh                                                  network is not ready: container runtime network not ready: NetworkReady=false reason:NetworkPluginNotReady message:Network plugin returns error: cni plugin not initialized
gmp-system                    4m8s        Normal    Scheduled                                pod/collector-w7vrh                                                  Successfully assigned gmp-system/collector-w7vrh to gke-ttriggers-e2e-cls190-default-pool-9e336d64-xmf0
gmp-system                    4m          Warning   FailedMount                              pod/collector-w7vrh                                                  MountVolume.SetUp failed for volume "config" : object "gmp-system"/"collector" not registered
gmp-system                    4m          Warning   FailedMount                              pod/collector-w7vrh                                                  MountVolume.SetUp failed for volume "collection-secret" : object "gmp-system"/"collection" not registered
gmp-system                    4m          Warning   FailedMount                              pod/collector-w7vrh                                                  MountVolume.SetUp failed for volume "kube-api-access-vg5cd" : object "gmp-system"/"kube-root-ca.crt" not registered
gmp-system                    3m52s       Warning   FailedMount                              pod/collector-w7vrh                                                  MountVolume.SetUp failed for volume "config" : configmap "collector" not found
gmp-system                    3m52s       Warning   FailedMount                              pod/collector-w7vrh                                                  MountVolume.SetUp failed for volume "collection-secret" : secret "collection" not found
gmp-system                    3m35s       Normal    Pulling                                  pod/collector-w7vrh                                                  Pulling image "us-central1-artifactregistry.gcr.io/gke-release/gke-release/gke-distroless/bash:gke_distroless_20240907.00_p0@sha256:ff5d5abcc0cdd74d3ba43b0959b246c4432c14356b1414ce35d8feff820eb664"
gmp-system                    3m34s       Normal    Pulled                                   pod/collector-w7vrh                                                  Successfully pulled image "us-central1-artifactregistry.gcr.io/gke-release/gke-release/gke-distroless/bash:gke_distroless_20240907.00_p0@sha256:ff5d5abcc0cdd74d3ba43b0959b246c4432c14356b1414ce35d8feff820eb664" in 1.219s (1.219s including waiting). Image size: 18373482 bytes.
gmp-system                    4m10s       Normal    SuccessfulCreate                         daemonset/collector                                                  Created pod: collector-nxgmb
gmp-system                    4m8s        Normal    SuccessfulCreate                         daemonset/collector                                                  Created pod: collector-5kgst
gmp-system                    4m8s        Normal    SuccessfulCreate                         daemonset/collector                                                  Created pod: collector-w7vrh
gmp-system                    4m44s       Warning   FailedScheduling                         pod/gmp-operator-5fcd5974-69475                                      no nodes available to schedule pods
... skipping 5 lines ...
gmp-system                    3m45s       Normal    Started                                  pod/gmp-operator-5fcd5974-69475                                      Started container operator
gmp-system                    4m44s       Normal    SuccessfulCreate                         replicaset/gmp-operator-5fcd5974                                     Created pod: gmp-operator-5fcd5974-69475
gmp-system                    4m45s       Normal    ScalingReplicaSet                        deployment/gmp-operator                                              Scaled up replica set gmp-operator-5fcd5974 to 1
gmp-system                    4m44s       Warning   FailedScheduling                         pod/rule-evaluator-858df77cc7-4dwzf                                  no nodes available to schedule pods
gmp-system                    4m41s       Warning   FailedScheduling                         pod/rule-evaluator-858df77cc7-4dwzf                                  no nodes available to schedule pods
gmp-system                    3m50s       Normal    Scheduled                                pod/rule-evaluator-858df77cc7-4dwzf                                  Successfully assigned gmp-system/rule-evaluator-858df77cc7-4dwzf to gke-ttriggers-e2e-cls190-default-pool-f65a2cb6-km8q
gmp-system                    3m46s       Warning   FailedMount                              pod/rule-evaluator-858df77cc7-4dwzf                                  MountVolume.SetUp failed for volume "config" : configmap "rule-evaluator" not found
gmp-system                    3m46s       Warning   FailedMount                              pod/rule-evaluator-858df77cc7-4dwzf                                  MountVolume.SetUp failed for volume "rules-secret" : secret "rules" not found
gmp-system                    3m46s       Warning   FailedMount                              pod/rule-evaluator-858df77cc7-4dwzf                                  MountVolume.SetUp failed for volume "rules" : configmap "rules-generated" not found
gmp-system                    4m44s       Normal    SuccessfulCreate                         replicaset/rule-evaluator-858df77cc7                                 Created pod: rule-evaluator-858df77cc7-4dwzf
gmp-system                    3m44s       Normal    SuccessfulDelete                         replicaset/rule-evaluator-858df77cc7                                 Deleted pod: rule-evaluator-858df77cc7-4dwzf
gmp-system                    4m44s       Normal    ScalingReplicaSet                        deployment/rule-evaluator                                            Scaled up replica set rule-evaluator-858df77cc7 to 1
gmp-system                    3m44s       Normal    ScalingReplicaSet                        deployment/rule-evaluator                                            Scaled down replica set rule-evaluator-858df77cc7 to 0 from 1
kube-system                   5m28s       Normal    LeaderElection                           lease/addon-manager                                                  gke-e57d40204f5141e5849c-1ae8-ea5b-vm_ad375151-8a8b-46a5-9de4-5a65d849304d became leader
kube-system                   4m37s       Normal    LeaderElection                           lease/addon-resizer                                                  gke-e57d40204f5141e5849c-1ae8-ea5b-vm became leader
... skipping 202 lines ...
kube-system                   3m41s       Normal    Created                                  pod/kube-dns-5c65f7b47-x7j7t                                         Created container: prometheus-to-sd
kube-system                   3m41s       Normal    Started                                  pod/kube-dns-5c65f7b47-x7j7t                                         Started container prometheus-to-sd
kube-system                   3m41s       Normal    Pulling                                  pod/kube-dns-5c65f7b47-x7j7t                                         Pulling image "us-central1-artifactregistry.gcr.io/gke-release/gke-release/gke-metrics-collector:20250209_2300_RC0@sha256:9678041ad0020efc360d4a9c0c616b48cc1224599545a103be3b2b853c521914"
kube-system                   3m40s       Normal    Pulled                                   pod/kube-dns-5c65f7b47-x7j7t                                         Successfully pulled image "us-central1-artifactregistry.gcr.io/gke-release/gke-release/gke-metrics-collector:20250209_2300_RC0@sha256:9678041ad0020efc360d4a9c0c616b48cc1224599545a103be3b2b853c521914" in 1.048s (1.048s including waiting). Image size: 25588923 bytes.
kube-system                   3m40s       Normal    Created                                  pod/kube-dns-5c65f7b47-x7j7t                                         Created container: kubedns-metrics-collector
kube-system                   3m39s       Normal    Started                                  pod/kube-dns-5c65f7b47-x7j7t                                         Started container kubedns-metrics-collector
kube-system                   5m21s       Warning   FailedCreate                             replicaset/kube-dns-5c65f7b47                                        Error creating: insufficient quota to match these scopes: [{PriorityClass In [system-node-critical system-cluster-critical]}]
kube-system                   5m21s       Normal    SuccessfulCreate                         replicaset/kube-dns-5c65f7b47                                        Created pod: kube-dns-5c65f7b47-8b42d
kube-system                   3m47s       Normal    SuccessfulCreate                         replicaset/kube-dns-5c65f7b47                                        Created pod: kube-dns-5c65f7b47-x7j7t
kube-system                   4m52s       Warning   FailedScheduling                         pod/kube-dns-autoscaler-8b7698c76-dctf4                              no nodes available to schedule pods
kube-system                   4m49s       Warning   FailedScheduling                         pod/kube-dns-autoscaler-8b7698c76-dctf4                              no nodes available to schedule pods
kube-system                   3m50s       Normal    Scheduled                                pod/kube-dns-autoscaler-8b7698c76-dctf4                              Successfully assigned kube-system/kube-dns-autoscaler-8b7698c76-dctf4 to gke-ttriggers-e2e-cls190-default-pool-f65a2cb6-km8q
kube-system                   3m49s       Normal    Pulling                                  pod/kube-dns-autoscaler-8b7698c76-dctf4                              Pulling image "us-central1-artifactregistry.gcr.io/gke-release/gke-release/cluster-proportional-autoscaler:v1.8.11-gke.22@sha256:5edd2b6dade7b1dbe25bc652ad5fbdf46c6155433729c48e738b970ec9ffdd8f"
... skipping 29 lines ...
kube-system                   3m50s       Normal    Scheduled                                pod/metrics-server-v1.31.0-65c95fbd4d-gmjjh                          Successfully assigned kube-system/metrics-server-v1.31.0-65c95fbd4d-gmjjh to gke-ttriggers-e2e-cls190-default-pool-f65a2cb6-km8q
kube-system                   3m49s       Normal    Pulling                                  pod/metrics-server-v1.31.0-65c95fbd4d-gmjjh                          Pulling image "us-central1-artifactregistry.gcr.io/gke-release/gke-release/metrics-server:v0.7.1-gke.32@sha256:cb17249a88fbbaeff5701654f5625a01d1faa0797faa6d463c121dde3fcc122f"
kube-system                   3m45s       Normal    Pulled                                   pod/metrics-server-v1.31.0-65c95fbd4d-gmjjh                          Successfully pulled image "us-central1-artifactregistry.gcr.io/gke-release/gke-release/metrics-server:v0.7.1-gke.32@sha256:cb17249a88fbbaeff5701654f5625a01d1faa0797faa6d463c121dde3fcc122f" in 1.738s (4.049s including waiting). Image size: 19267350 bytes.
kube-system                   3m45s       Normal    Created                                  pod/metrics-server-v1.31.0-65c95fbd4d-gmjjh                          Created container: metrics-server
kube-system                   3m45s       Normal    Started                                  pod/metrics-server-v1.31.0-65c95fbd4d-gmjjh                          Started container metrics-server
kube-system                   2m49s       Normal    Killing                                  pod/metrics-server-v1.31.0-65c95fbd4d-gmjjh                          Stopping container metrics-server
kube-system                   4m38s       Warning   FailedCreate                             replicaset/metrics-server-v1.31.0-65c95fbd4d                         Error creating: pods "metrics-server-v1.31.0-65c95fbd4d-" is forbidden: error looking up service account kube-system/metrics-server: serviceaccount "metrics-server" not found
kube-system                   4m37s       Normal    SuccessfulCreate                         replicaset/metrics-server-v1.31.0-65c95fbd4d                         Created pod: metrics-server-v1.31.0-65c95fbd4d-gmjjh
kube-system                   2m49s       Normal    SuccessfulDelete                         replicaset/metrics-server-v1.31.0-65c95fbd4d                         Deleted pod: metrics-server-v1.31.0-65c95fbd4d-gmjjh
kube-system                   4m36s       Warning   FailedScheduling                         pod/metrics-server-v1.31.0-769c5b4896-trssv                          no nodes available to schedule pods
kube-system                   4m33s       Warning   FailedScheduling                         pod/metrics-server-v1.31.0-769c5b4896-trssv                          no nodes available to schedule pods
kube-system                   4m          Warning   FailedScheduling                         pod/metrics-server-v1.31.0-769c5b4896-trssv                          0/3 nodes are available: 3 node(s) had untolerated taint {node.kubernetes.io/not-ready: }. preemption: 0/3 nodes are available: 3 Preemption is not helpful for scheduling.
kube-system                   3m50s       Normal    Scheduled                                pod/metrics-server-v1.31.0-769c5b4896-trssv                          Successfully assigned kube-system/metrics-server-v1.31.0-769c5b4896-trssv to gke-ttriggers-e2e-cls190-default-pool-f65a2cb6-km8q
... skipping 70 lines ...
tekton-pipelines              96s         Warning   FailedGetResourceMetric                  horizontalpodautoscaler/tekton-pipelines-webhook                     No recommendation
tekton-pipelines              1s          Normal    Scheduled                                pod/tekton-triggers-webhook-bb9469bc-wbfnp                           Successfully assigned tekton-pipelines/tekton-triggers-webhook-bb9469bc-wbfnp to gke-ttriggers-e2e-cls190-default-pool-693569f5-sff6
tekton-pipelines              1s          Normal    Pulling                                  pod/tekton-triggers-webhook-bb9469bc-wbfnp                           Pulling image "gcr.io/tekton-prow-3/ttriggers-e2e-img/webhook-dd1edc925ee1772a9f76e2c1bc291ef6@sha256:37aa84626510648eb3a1c3381bcc2ce62282891d9a8fdba59f66f04fee4dd62b"
tekton-pipelines              1s          Normal    SuccessfulCreate                         replicaset/tekton-triggers-webhook-bb9469bc                          Created pod: tekton-triggers-webhook-bb9469bc-wbfnp
tekton-pipelines              1s          Normal    ScalingReplicaSet                        deployment/tekton-triggers-webhook                                   Scaled up replica set tekton-triggers-webhook-bb9469bc to 1
***************************************
***         E2E TEST FAILED         ***
***     End of information dump     ***
***************************************
2025/03/31 10:42:33 process.go:155: Step '/home/prow/go/src/github.com/tektoncd/triggers/test/e2e-tests.sh --run-tests' finished in 3m23.614809091s
2025/03/31 10:42:33 main.go:319: Something went wrong: encountered 1 errors: [error during /home/prow/go/src/github.com/tektoncd/triggers/test/e2e-tests.sh --run-tests: exit status 1]
Test subprocess exited with code 0
Artifacts were written to /logs/artifacts
Test result code is 1
==================================
==== INTEGRATION TESTS FAILED ====
==================================
+ EXIT_VALUE=1
+ set +o xtrace