Error lines from build-log.txt
... skipping 356 lines ...
configmap/config-leader-election-triggers-controller created
configmap/config-leader-election-triggers-webhook created
configmap/config-logging-triggers created
configmap/config-observability-triggers created
service/tekton-triggers-controller created
service/tekton-triggers-webhook created
Error: error processing import paths in "config/webhook.yaml": error resolving image references: GET https://gcr.io/v2/token?scope=repository%3Atekton-prow-10%2Fttriggers-e2e-img%2Fwebhook-dd1edc925ee1772a9f76e2c1bc291ef6%3Apush%2Cpull&scope=repository%3Adistroless%2Fstatic%3Apull&service=gcr.io: unexpected status code 412 Precondition Failed: Container Registry is deprecated and shutting down, please use the auto migration tool to migrate to Artifact Registry (gcloud artifacts docker upgrade migrate --projects='tekton-prow-10'). For more details see: https://cloud.google.com/artifact-registry/docs/transition/auto-migrate-gcr-ar
ERROR: Tekton Triggers installation failed
***************************************
*** E2E TEST FAILED ***
*** Start of information dump ***
***************************************
>>> All resources:
NAMESPACE NAME READY STATUS RESTARTS AGE
gke-managed-cim pod/kube-state-metrics-0 2/2 Running 0 3m48s
gmp-system pod/collector-2htr9 2/2 Running 0 2m42s
... skipping 164 lines ...
gke-managed-cim 2m21s Normal Created pod/kube-state-metrics-0 Created container: kube-state-metrics
gke-managed-cim 2m21s Normal Started pod/kube-state-metrics-0 Started container kube-state-metrics
gke-managed-cim 2m21s Normal Pulling pod/kube-state-metrics-0 Pulling image "us-central1-artifactregistry.gcr.io/gke-release/gke-release/gke-metrics-collector:20240501_2300_RC0@sha256:af727fbef6a16960bd3541d89b94e1a4938b57041e5869f148995d8c271a6334"
gke-managed-cim 2m17s Normal Pulled pod/kube-state-metrics-0 Successfully pulled image "us-central1-artifactregistry.gcr.io/gke-release/gke-release/gke-metrics-collector:20240501_2300_RC0@sha256:af727fbef6a16960bd3541d89b94e1a4938b57041e5869f148995d8c271a6334" in 1.232s (4.559s including waiting). Image size: 23786769 bytes.
gke-managed-cim 2m17s Normal Created pod/kube-state-metrics-0 Created container: ksm-metrics-collector
gke-managed-cim 2m16s Normal Started pod/kube-state-metrics-0 Started container ksm-metrics-collector
gke-managed-cim 3m49s Warning FailedCreate statefulset/kube-state-metrics create Pod kube-state-metrics-0 in StatefulSet kube-state-metrics failed error: pods "kube-state-metrics-0" is forbidden: error looking up service account gke-managed-cim/kube-state-metrics: serviceaccount "kube-state-metrics" not found
gke-managed-cim 3m49s Normal SuccessfulCreate statefulset/kube-state-metrics create Pod kube-state-metrics-0 in StatefulSet kube-state-metrics successful
gke-managed-cim 78s Warning FailedGetResourceMetric horizontalpodautoscaler/kube-state-metrics unable to get metric memory: unable to fetch metrics from resource metrics API: the server is currently unable to handle the request (get pods.metrics.k8s.io)
gke-managed-cim 65s Warning FailedGetResourceMetric horizontalpodautoscaler/kube-state-metrics unable to get metric memory: no metrics returned from resource metrics API
gke-managed-volumepopulator 3m32s Normal LeaderElection lease/gke-volume-populator-leader gke-8c9f18b6cfad4a3cb585-c778-2f72-vm became leader
gmp-system 3m16s Warning FailedScheduling pod/alertmanager-0 no nodes available to schedule pods
gmp-system 3m12s Warning FailedScheduling pod/alertmanager-0 no nodes available to schedule pods
gmp-system 2m23s Normal Scheduled pod/alertmanager-0 Successfully assigned gmp-system/alertmanager-0 to gke-ttriggers-e2e-cls190-default-pool-28a73521-4xv1
gmp-system 2m16s Warning FailedMount pod/alertmanager-0 MountVolume.SetUp failed for volume "config" : secret "alertmanager" not found
gmp-system 3m16s Normal SuccessfulCreate statefulset/alertmanager create Pod alertmanager-0 in StatefulSet alertmanager successful
gmp-system 2m16s Normal SuccessfulDelete statefulset/alertmanager delete Pod alertmanager-0 in StatefulSet alertmanager successful
gmp-system 2m42s Normal Scheduled pod/collector-2htr9 Successfully assigned gmp-system/collector-2htr9 to gke-ttriggers-e2e-cls190-default-pool-5710f03a-6f7m
gmp-system 2m33s Warning NetworkNotReady pod/collector-2htr9 network is not ready: container runtime network not ready: NetworkReady=false reason:NetworkPluginNotReady message:Network plugin returns error: cni plugin not initialized
gmp-system 2m35s Warning FailedMount pod/collector-2htr9 MountVolume.SetUp failed for volume "collection-secret" : object "gmp-system"/"collection" not registered
gmp-system 2m35s Warning FailedMount pod/collector-2htr9 MountVolume.SetUp failed for volume "config" : object "gmp-system"/"collector" not registered
gmp-system 2m35s Warning FailedMount pod/collector-2htr9 MountVolume.SetUp failed for volume "kube-api-access-jc7mx" : object "gmp-system"/"kube-root-ca.crt" not registered
gmp-system 2m27s Warning FailedMount pod/collector-2htr9 MountVolume.SetUp failed for volume "collection-secret" : secret "collection" not found
gmp-system 2m27s Warning FailedMount pod/collector-2htr9 MountVolume.SetUp failed for volume "config" : configmap "collector" not found
gmp-system 2m10s Normal Pulling pod/collector-2htr9 Pulling image "us-central1-artifactregistry.gcr.io/gke-release/gke-release/gke-distroless/bash:gke_distroless_20240907.00_p0@sha256:ff5d5abcc0cdd74d3ba43b0959b246c4432c14356b1414ce35d8feff820eb664"
gmp-system 2m9s Normal Pulled pod/collector-2htr9 Successfully pulled image "us-central1-artifactregistry.gcr.io/gke-release/gke-release/gke-distroless/bash:gke_distroless_20240907.00_p0@sha256:ff5d5abcc0cdd74d3ba43b0959b246c4432c14356b1414ce35d8feff820eb664" in 946ms (946ms including waiting). Image size: 18373482 bytes.
gmp-system 2m41s Normal Scheduled pod/collector-mdv5t Successfully assigned gmp-system/collector-mdv5t to gke-ttriggers-e2e-cls190-default-pool-ea085574-vmrl
gmp-system 2m31s Warning NetworkNotReady pod/collector-mdv5t network is not ready: container runtime network not ready: NetworkReady=false reason:NetworkPluginNotReady message:Network plugin returns error: cni plugin not initialized
gmp-system 2m34s Warning FailedMount pod/collector-mdv5t MountVolume.SetUp failed for volume "config" : object "gmp-system"/"collector" not registered
gmp-system 2m34s Warning FailedMount pod/collector-mdv5t MountVolume.SetUp failed for volume "collection-secret" : object "gmp-system"/"collection" not registered
gmp-system 2m33s Warning FailedMount pod/collector-mdv5t MountVolume.SetUp failed for volume "kube-api-access-54v7m" : object "gmp-system"/"kube-root-ca.crt" not registered
gmp-system 2m25s Warning FailedMount pod/collector-mdv5t MountVolume.SetUp failed for volume "config" : configmap "collector" not found
gmp-system 2m25s Warning FailedMount pod/collector-mdv5t MountVolume.SetUp failed for volume "collection-secret" : secret "collection" not found
gmp-system 2m9s Normal Pulling pod/collector-mdv5t Pulling image "us-central1-artifactregistry.gcr.io/gke-release/gke-release/gke-distroless/bash:gke_distroless_20240907.00_p0@sha256:ff5d5abcc0cdd74d3ba43b0959b246c4432c14356b1414ce35d8feff820eb664"
gmp-system 2m8s Normal Pulled pod/collector-mdv5t Successfully pulled image "us-central1-artifactregistry.gcr.io/gke-release/gke-release/gke-distroless/bash:gke_distroless_20240907.00_p0@sha256:ff5d5abcc0cdd74d3ba43b0959b246c4432c14356b1414ce35d8feff820eb664" in 1.548s (1.548s including waiting). Image size: 18373482 bytes.
gmp-system 2m43s Normal Scheduled pod/collector-mw9rw Successfully assigned gmp-system/collector-mw9rw to gke-ttriggers-e2e-cls190-default-pool-28a73521-4xv1
gmp-system 2m32s Warning NetworkNotReady pod/collector-mw9rw network is not ready: container runtime network not ready: NetworkReady=false reason:NetworkPluginNotReady message:Network plugin returns error: cni plugin not initialized
gmp-system 2m36s Warning FailedMount pod/collector-mw9rw MountVolume.SetUp failed for volume "collection-secret" : object "gmp-system"/"collection" not registered
gmp-system 2m36s Warning FailedMount pod/collector-mw9rw MountVolume.SetUp failed for volume "config" : object "gmp-system"/"collector" not registered
gmp-system 2m35s Warning FailedMount pod/collector-mw9rw MountVolume.SetUp failed for volume "kube-api-access-56896" : object "gmp-system"/"kube-root-ca.crt" not registered
gmp-system 2m28s Warning FailedMount pod/collector-mw9rw MountVolume.SetUp failed for volume "config" : configmap "collector" not found
gmp-system 2m28s Warning FailedMount pod/collector-mw9rw MountVolume.SetUp failed for volume "collection-secret" : secret "collection" not found
gmp-system 2m11s Normal Pulling pod/collector-mw9rw Pulling image "us-central1-artifactregistry.gcr.io/gke-release/gke-release/gke-distroless/bash:gke_distroless_20240907.00_p0@sha256:ff5d5abcc0cdd74d3ba43b0959b246c4432c14356b1414ce35d8feff820eb664"
gmp-system 2m44s Normal SuccessfulCreate daemonset/collector Created pod: collector-mw9rw
gmp-system 2m43s Normal SuccessfulCreate daemonset/collector Created pod: collector-2htr9
gmp-system 2m41s Normal SuccessfulCreate daemonset/collector Created pod: collector-mdv5t
gmp-system 3m16s Warning FailedScheduling pod/gmp-operator-86bc696b6c-2b6d6 no nodes available to schedule pods
gmp-system 3m13s Warning FailedScheduling pod/gmp-operator-86bc696b6c-2b6d6 no nodes available to schedule pods
... skipping 4 lines ...
gmp-system 2m17s Normal Started pod/gmp-operator-86bc696b6c-2b6d6 Started container operator
gmp-system 3m17s Normal SuccessfulCreate replicaset/gmp-operator-86bc696b6c Created pod: gmp-operator-86bc696b6c-2b6d6
gmp-system 3m17s Normal ScalingReplicaSet deployment/gmp-operator Scaled up replica set gmp-operator-86bc696b6c to 1
gmp-system 3m16s Warning FailedScheduling pod/rule-evaluator-858df77cc7-kt4ph no nodes available to schedule pods
gmp-system 3m13s Warning FailedScheduling pod/rule-evaluator-858df77cc7-kt4ph no nodes available to schedule pods
gmp-system 2m23s Normal Scheduled pod/rule-evaluator-858df77cc7-kt4ph Successfully assigned gmp-system/rule-evaluator-858df77cc7-kt4ph to gke-ttriggers-e2e-cls190-default-pool-28a73521-4xv1
gmp-system 2m16s Warning FailedMount pod/rule-evaluator-858df77cc7-kt4ph MountVolume.SetUp failed for volume "config" : configmap "rule-evaluator" not found
gmp-system 2m16s Warning FailedMount pod/rule-evaluator-858df77cc7-kt4ph MountVolume.SetUp failed for volume "rules-secret" : secret "rules" not found
gmp-system 2m20s Warning FailedMount pod/rule-evaluator-858df77cc7-kt4ph MountVolume.SetUp failed for volume "rules" : configmap "rules-generated" not found
gmp-system 3m16s Normal SuccessfulCreate replicaset/rule-evaluator-858df77cc7 Created pod: rule-evaluator-858df77cc7-kt4ph
gmp-system 2m16s Normal SuccessfulDelete replicaset/rule-evaluator-858df77cc7 Deleted pod: rule-evaluator-858df77cc7-kt4ph
gmp-system 3m17s Normal ScalingReplicaSet deployment/rule-evaluator Scaled up replica set rule-evaluator-858df77cc7 to 1
gmp-system 2m16s Normal ScalingReplicaSet deployment/rule-evaluator Scaled down replica set rule-evaluator-858df77cc7 to 0 from 1
kube-system 3m59s Normal LeaderElection lease/addon-manager gke-8c9f18b6cfad4a3cb585-c778-2f72-vm_ffec0ffe-088a-44b4-8352-19a1366ac0d3 became leader
kube-system 3m10s Normal LeaderElection lease/addon-resizer gke-8c9f18b6cfad4a3cb585-c778-2f72-vm became leader
... skipping 243 lines ...
kube-system 2m23s Normal Scheduled pod/metrics-server-v1.31.0-65c95fbd4d-29vq8 Successfully assigned kube-system/metrics-server-v1.31.0-65c95fbd4d-29vq8 to gke-ttriggers-e2e-cls190-default-pool-28a73521-4xv1
kube-system 2m22s Normal Pulling pod/metrics-server-v1.31.0-65c95fbd4d-29vq8 Pulling image "us-central1-artifactregistry.gcr.io/gke-release/gke-release/metrics-server:v0.7.1-gke.32@sha256:cb17249a88fbbaeff5701654f5625a01d1faa0797faa6d463c121dde3fcc122f"
kube-system 2m20s Normal Pulled pod/metrics-server-v1.31.0-65c95fbd4d-29vq8 Successfully pulled image "us-central1-artifactregistry.gcr.io/gke-release/gke-release/metrics-server:v0.7.1-gke.32@sha256:cb17249a88fbbaeff5701654f5625a01d1faa0797faa6d463c121dde3fcc122f" in 1.431s (2.606s including waiting). Image size: 19267350 bytes.
kube-system 2m20s Normal Created pod/metrics-server-v1.31.0-65c95fbd4d-29vq8 Created container: metrics-server
kube-system 2m20s Normal Started pod/metrics-server-v1.31.0-65c95fbd4d-29vq8 Started container metrics-server
kube-system 83s Normal Killing pod/metrics-server-v1.31.0-65c95fbd4d-29vq8 Stopping container metrics-server
kube-system 3m12s Warning FailedCreate replicaset/metrics-server-v1.31.0-65c95fbd4d Error creating: pods "metrics-server-v1.31.0-65c95fbd4d-" is forbidden: error looking up service account kube-system/metrics-server: serviceaccount "metrics-server" not found
kube-system 3m11s Normal SuccessfulCreate replicaset/metrics-server-v1.31.0-65c95fbd4d Created pod: metrics-server-v1.31.0-65c95fbd4d-29vq8
kube-system 83s Normal SuccessfulDelete replicaset/metrics-server-v1.31.0-65c95fbd4d Deleted pod: metrics-server-v1.31.0-65c95fbd4d-29vq8
kube-system 3m9s Warning FailedScheduling pod/metrics-server-v1.31.0-769c5b4896-mnm45 no nodes available to schedule pods
kube-system 3m6s Warning FailedScheduling pod/metrics-server-v1.31.0-769c5b4896-mnm45 no nodes available to schedule pods
kube-system 2m23s Normal Scheduled pod/metrics-server-v1.31.0-769c5b4896-mnm45 Successfully assigned kube-system/metrics-server-v1.31.0-769c5b4896-mnm45 to gke-ttriggers-e2e-cls190-default-pool-28a73521-4xv1
kube-system 2m22s Normal Pulling pod/metrics-server-v1.31.0-769c5b4896-mnm45 Pulling image "us-central1-artifactregistry.gcr.io/gke-release/gke-release/metrics-server:v0.7.1-gke.32@sha256:cb17249a88fbbaeff5701654f5625a01d1faa0797faa6d463c121dde3fcc122f"
... skipping 65 lines ...
tekton-pipelines 108s Normal Created pod/tekton-pipelines-webhook-6d8cc7bdcf-jdb8b Created container: webhook
tekton-pipelines 108s Normal Started pod/tekton-pipelines-webhook-6d8cc7bdcf-jdb8b Started container webhook
tekton-pipelines 111s Normal SuccessfulCreate replicaset/tekton-pipelines-webhook-6d8cc7bdcf Created pod: tekton-pipelines-webhook-6d8cc7bdcf-jdb8b
tekton-pipelines 111s Normal ScalingReplicaSet deployment/tekton-pipelines-webhook Scaled up replica set tekton-pipelines-webhook-6d8cc7bdcf to 1
tekton-pipelines 35s Warning FailedGetResourceMetric horizontalpodautoscaler/tekton-pipelines-webhook No recommendation
***************************************
*** E2E TEST FAILED ***
*** End of information dump ***
***************************************
2025/03/28 13:00:15 process.go:155: Step '/home/prow/go/src/github.com/tektoncd/triggers/test/e2e-tests.sh --run-tests' finished in 2m3.816099217s
2025/03/28 13:00:15 main.go:319: Something went wrong: encountered 1 errors: [error during /home/prow/go/src/github.com/tektoncd/triggers/test/e2e-tests.sh --run-tests: exit status 1]
Test subprocess exited with code 0
Artifacts were written to /logs/artifacts
Test result code is 1
==================================
==== INTEGRATION TESTS FAILED ====
==================================
+ EXIT_VALUE=1
+ set +o xtrace