Error lines from build-log.txt
... skipping 356 lines ...
configmap/config-leader-election-triggers-controller created
configmap/config-leader-election-triggers-webhook created
configmap/config-logging-triggers created
configmap/config-observability-triggers created
service/tekton-triggers-controller created
service/tekton-triggers-webhook created
Error: error processing import paths in "config/controller.yaml": error resolving image references: GET https://gcr.io/v2/token?scope=repository%3Atekton-prow-1%2Fttriggers-e2e-img%2Feventlistenersink-7ad1faa98cddbcb0c24990303b220bb8%3Apush%2Cpull&scope=repository%3Adistroless%2Fstatic%3Apull&service=gcr.io: unexpected status code 412 Precondition Failed: Container Registry is deprecated and shutting down, please use the auto migration tool to migrate to Artifact Registry (gcloud artifacts docker upgrade migrate --projects='tekton-prow-1'). For more details see: https://cloud.google.com/artifact-registry/docs/transition/auto-migrate-gcr-ar
ERROR: Tekton Triggers installation failed
***************************************
*** E2E TEST FAILED ***
*** Start of information dump ***
***************************************
>>> All resources:
NAMESPACE NAME READY STATUS RESTARTS AGE
gke-managed-cim pod/kube-state-metrics-0 2/2 Running 0 4m2s
gmp-system pod/collector-dr5tp 2/2 Running 0 2m50s
... skipping 165 lines ...
gke-managed-cim 2m28s Normal Created pod/kube-state-metrics-0 Created container: kube-state-metrics
gke-managed-cim 2m28s Normal Started pod/kube-state-metrics-0 Started container kube-state-metrics
gke-managed-cim 2m28s Normal Pulling pod/kube-state-metrics-0 Pulling image "us-central1-artifactregistry.gcr.io/gke-release/gke-release/gke-metrics-collector:20240501_2300_RC0@sha256:af727fbef6a16960bd3541d89b94e1a4938b57041e5869f148995d8c271a6334"
gke-managed-cim 2m24s Normal Pulled pod/kube-state-metrics-0 Successfully pulled image "us-central1-artifactregistry.gcr.io/gke-release/gke-release/gke-metrics-collector:20240501_2300_RC0@sha256:af727fbef6a16960bd3541d89b94e1a4938b57041e5869f148995d8c271a6334" in 1.885s (4.506s including waiting). Image size: 23786769 bytes.
gke-managed-cim 2m24s Normal Created pod/kube-state-metrics-0 Created container: ksm-metrics-collector
gke-managed-cim 2m23s Normal Started pod/kube-state-metrics-0 Started container ksm-metrics-collector
gke-managed-cim 4m3s Warning FailedCreate statefulset/kube-state-metrics create Pod kube-state-metrics-0 in StatefulSet kube-state-metrics failed error: pods "kube-state-metrics-0" is forbidden: error looking up service account gke-managed-cim/kube-state-metrics: serviceaccount "kube-state-metrics" not found
gke-managed-cim 4m2s Normal SuccessfulCreate statefulset/kube-state-metrics create Pod kube-state-metrics-0 in StatefulSet kube-state-metrics successful
gke-managed-cim 88s Warning FailedGetResourceMetric horizontalpodautoscaler/kube-state-metrics unable to get metric memory: unable to fetch metrics from resource metrics API: the server is currently unable to handle the request (get pods.metrics.k8s.io)
gke-managed-cim 65s Warning FailedGetResourceMetric horizontalpodautoscaler/kube-state-metrics unable to get metric memory: no metrics returned from resource metrics API
gke-managed-volumepopulator 3m43s Normal LeaderElection lease/gke-volume-populator-leader gke-345c619538ff49979131-9922-3a2c-vm became leader
gmp-system 3m27s Warning FailedScheduling pod/alertmanager-0 no nodes available to schedule pods
gmp-system 3m23s Warning FailedScheduling pod/alertmanager-0 no nodes available to schedule pods
gmp-system 2m30s Normal Scheduled pod/alertmanager-0 Successfully assigned gmp-system/alertmanager-0 to gke-ttriggers-e2e-cls190-default-pool-4e8c6bda-g0t6
gmp-system 2m27s Warning FailedMount pod/alertmanager-0 MountVolume.SetUp failed for volume "config" : secret "alertmanager" not found
gmp-system 3m28s Normal SuccessfulCreate statefulset/alertmanager create Pod alertmanager-0 in StatefulSet alertmanager successful
gmp-system 2m24s Normal SuccessfulDelete statefulset/alertmanager delete Pod alertmanager-0 in StatefulSet alertmanager successful
gmp-system 2m50s Normal Scheduled pod/collector-dr5tp Successfully assigned gmp-system/collector-dr5tp to gke-ttriggers-e2e-cls190-default-pool-4e8c6bda-g0t6
gmp-system 2m38s Warning NetworkNotReady pod/collector-dr5tp network is not ready: container runtime network not ready: NetworkReady=false reason:NetworkPluginNotReady message:Network plugin returns error: cni plugin not initialized
gmp-system 2m43s Warning FailedMount pod/collector-dr5tp MountVolume.SetUp failed for volume "collection-secret" : object "gmp-system"/"collection" not registered
gmp-system 2m43s Warning FailedMount pod/collector-dr5tp MountVolume.SetUp failed for volume "config" : object "gmp-system"/"collector" not registered
gmp-system 2m43s Warning FailedMount pod/collector-dr5tp MountVolume.SetUp failed for volume "kube-api-access-m87n4" : object "gmp-system"/"kube-root-ca.crt" not registered
gmp-system 2m35s Warning FailedMount pod/collector-dr5tp MountVolume.SetUp failed for volume "config" : configmap "collector" not found
gmp-system 2m35s Warning FailedMount pod/collector-dr5tp MountVolume.SetUp failed for volume "collection-secret" : secret "collection" not found
gmp-system 2m18s Normal Pulling pod/collector-dr5tp Pulling image "us-central1-artifactregistry.gcr.io/gke-release/gke-release/gke-distroless/bash:gke_distroless_20240907.00_p0@sha256:ff5d5abcc0cdd74d3ba43b0959b246c4432c14356b1414ce35d8feff820eb664"
gmp-system 2m39s Warning NetworkNotReady pod/collector-q7m6t network is not ready: container runtime network not ready: NetworkReady=false reason:NetworkPluginNotReady message:Network plugin returns error: cni plugin not initialized
gmp-system 2m48s Normal Scheduled pod/collector-q7m6t Successfully assigned gmp-system/collector-q7m6t to gke-ttriggers-e2e-cls190-default-pool-e6fdb676-cjz3
gmp-system 2m41s Warning FailedMount pod/collector-q7m6t MountVolume.SetUp failed for volume "config" : object "gmp-system"/"collector" not registered
gmp-system 2m41s Warning FailedMount pod/collector-q7m6t MountVolume.SetUp failed for volume "collection-secret" : object "gmp-system"/"collection" not registered
gmp-system 2m41s Warning FailedMount pod/collector-q7m6t MountVolume.SetUp failed for volume "kube-api-access-cfwrf" : object "gmp-system"/"kube-root-ca.crt" not registered
gmp-system 2m33s Warning FailedMount pod/collector-q7m6t MountVolume.SetUp failed for volume "config" : configmap "collector" not found
gmp-system 2m33s Warning FailedMount pod/collector-q7m6t MountVolume.SetUp failed for volume "collection-secret" : secret "collection" not found
gmp-system 2m16s Normal Pulling pod/collector-q7m6t Pulling image "us-central1-artifactregistry.gcr.io/gke-release/gke-release/gke-distroless/bash:gke_distroless_20240907.00_p0@sha256:ff5d5abcc0cdd74d3ba43b0959b246c4432c14356b1414ce35d8feff820eb664"
gmp-system 2m15s Normal Pulled pod/collector-q7m6t Successfully pulled image "us-central1-artifactregistry.gcr.io/gke-release/gke-release/gke-distroless/bash:gke_distroless_20240907.00_p0@sha256:ff5d5abcc0cdd74d3ba43b0959b246c4432c14356b1414ce35d8feff820eb664" in 1.239s (1.239s including waiting). Image size: 18373482 bytes.
gmp-system 2m50s Normal Scheduled pod/collector-rwsl6 Successfully assigned gmp-system/collector-rwsl6 to gke-ttriggers-e2e-cls190-default-pool-39524773-pwv1
gmp-system 2m41s Warning NetworkNotReady pod/collector-rwsl6 network is not ready: container runtime network not ready: NetworkReady=false reason:NetworkPluginNotReady message:Network plugin returns error: cni plugin not initialized
gmp-system 2m43s Warning FailedMount pod/collector-rwsl6 MountVolume.SetUp failed for volume "collection-secret" : object "gmp-system"/"collection" not registered
gmp-system 2m43s Warning FailedMount pod/collector-rwsl6 MountVolume.SetUp failed for volume "config" : object "gmp-system"/"collector" not registered
gmp-system 2m43s Warning FailedMount pod/collector-rwsl6 MountVolume.SetUp failed for volume "kube-api-access-sxzz6" : object "gmp-system"/"kube-root-ca.crt" not registered
gmp-system 2m35s Warning FailedMount pod/collector-rwsl6 MountVolume.SetUp failed for volume "config" : configmap "collector" not found
gmp-system 2m35s Warning FailedMount pod/collector-rwsl6 MountVolume.SetUp failed for volume "collection-secret" : secret "collection" not found
gmp-system 2m19s Normal Pulling pod/collector-rwsl6 Pulling image "us-central1-artifactregistry.gcr.io/gke-release/gke-release/gke-distroless/bash:gke_distroless_20240907.00_p0@sha256:ff5d5abcc0cdd74d3ba43b0959b246c4432c14356b1414ce35d8feff820eb664"
gmp-system 2m18s Normal Pulled pod/collector-rwsl6 Successfully pulled image "us-central1-artifactregistry.gcr.io/gke-release/gke-release/gke-distroless/bash:gke_distroless_20240907.00_p0@sha256:ff5d5abcc0cdd74d3ba43b0959b246c4432c14356b1414ce35d8feff820eb664" in 876ms (876ms including waiting). Image size: 18373482 bytes.
gmp-system 2m51s Normal SuccessfulCreate daemonset/collector Created pod: collector-rwsl6
gmp-system 2m51s Normal SuccessfulCreate daemonset/collector Created pod: collector-dr5tp
gmp-system 2m49s Normal SuccessfulCreate daemonset/collector Created pod: collector-q7m6t
gmp-system 3m27s Warning FailedScheduling pod/gmp-operator-5c968d7b8d-cjnj5 no nodes available to schedule pods
... skipping 5 lines ...
gmp-system 2m25s Normal Started pod/gmp-operator-5c968d7b8d-cjnj5 Started container operator
gmp-system 3m28s Normal SuccessfulCreate replicaset/gmp-operator-5c968d7b8d Created pod: gmp-operator-5c968d7b8d-cjnj5
gmp-system 3m28s Normal ScalingReplicaSet deployment/gmp-operator Scaled up replica set gmp-operator-5c968d7b8d to 1
gmp-system 3m27s Warning FailedScheduling pod/rule-evaluator-858df77cc7-m79rl no nodes available to schedule pods
gmp-system 3m23s Warning FailedScheduling pod/rule-evaluator-858df77cc7-m79rl no nodes available to schedule pods
gmp-system 2m30s Normal Scheduled pod/rule-evaluator-858df77cc7-m79rl Successfully assigned gmp-system/rule-evaluator-858df77cc7-m79rl to gke-ttriggers-e2e-cls190-default-pool-4e8c6bda-g0t6
gmp-system 2m27s Warning FailedMount pod/rule-evaluator-858df77cc7-m79rl MountVolume.SetUp failed for volume "config" : configmap "rule-evaluator" not found
gmp-system 2m27s Warning FailedMount pod/rule-evaluator-858df77cc7-m79rl MountVolume.SetUp failed for volume "rules-secret" : secret "rules" not found
gmp-system 2m27s Warning FailedMount pod/rule-evaluator-858df77cc7-m79rl MountVolume.SetUp failed for volume "rules" : configmap "rules-generated" not found
gmp-system 3m28s Normal SuccessfulCreate replicaset/rule-evaluator-858df77cc7 Created pod: rule-evaluator-858df77cc7-m79rl
gmp-system 2m24s Normal SuccessfulDelete replicaset/rule-evaluator-858df77cc7 Deleted pod: rule-evaluator-858df77cc7-m79rl
gmp-system 3m28s Normal ScalingReplicaSet deployment/rule-evaluator Scaled up replica set rule-evaluator-858df77cc7 to 1
gmp-system 2m24s Normal ScalingReplicaSet deployment/rule-evaluator Scaled down replica set rule-evaluator-858df77cc7 to 0 from 1
kube-system 4m11s Normal LeaderElection lease/addon-manager gke-345c619538ff49979131-9922-3a2c-vm_b08faa3b-ad1a-4faa-90ae-b2b945f4c22f became leader
kube-system 3m20s Normal LeaderElection lease/addon-resizer gke-345c619538ff49979131-2cb5-70f8-vm became leader
... skipping 86 lines ...
kube-system 2m48s Normal Started pod/gke-metrics-agent-4p225 Started container core-metrics-exporter
kube-system 2m48s Normal Pulling pod/gke-metrics-agent-4p225 Pulling image "us-central1-artifactregistry.gcr.io/gke-release/gke-release/gke-metrics-collector:20240902_2300_RC0@sha256:52df59dabb65d3d315ee03768ca1e9d84da2821a799c54cab7539f5f5b19849e"
kube-system 2m47s Normal Pulled pod/gke-metrics-agent-4p225 Successfully pulled image "us-central1-artifactregistry.gcr.io/gke-release/gke-release/gke-metrics-collector:20240902_2300_RC0@sha256:52df59dabb65d3d315ee03768ca1e9d84da2821a799c54cab7539f5f5b19849e" in 1.519s (1.519s including waiting). Image size: 24781314 bytes.
kube-system 2m47s Normal Created pod/gke-metrics-agent-4p225 Created container: prometheus-metrics-collector
kube-system 2m47s Normal Started pod/gke-metrics-agent-4p225 Started container prometheus-metrics-collector
kube-system 2m49s Normal Scheduled pod/gke-metrics-agent-5vh72 Successfully assigned kube-system/gke-metrics-agent-5vh72 to gke-ttriggers-e2e-cls190-default-pool-4e8c6bda-g0t6
kube-system 2m49s Warning FailedMount pod/gke-metrics-agent-5vh72 MountVolume.SetUp failed for volume "gke-metrics-agent-config-vol" : failed to sync configmap cache: timed out waiting for the condition
kube-system 2m48s Normal Pulling pod/gke-metrics-agent-5vh72 Pulling image "us-central1-artifactregistry.gcr.io/gke-release/gke-release/gke-metrics-agent:1.13.0-gke.2@sha256:919c4c4d46db4c8a0125eb2254d073c882c6b765a1d2c713e69bbe6b6c94cd86"
kube-system 2m45s Normal Pulled pod/gke-metrics-agent-5vh72 Successfully pulled image "us-central1-artifactregistry.gcr.io/gke-release/gke-release/gke-metrics-agent:1.13.0-gke.2@sha256:919c4c4d46db4c8a0125eb2254d073c882c6b765a1d2c713e69bbe6b6c94cd86" in 3.291s (3.291s including waiting). Image size: 27456613 bytes.
kube-system 2m45s Normal Created pod/gke-metrics-agent-5vh72 Created container: gke-metrics-agent
kube-system 2m44s Normal Started pod/gke-metrics-agent-5vh72 Started container gke-metrics-agent
kube-system 2m44s Normal Pulled pod/gke-metrics-agent-5vh72 Container image "us-central1-artifactregistry.gcr.io/gke-release/gke-release/gke-metrics-agent:1.13.0-gke.2@sha256:919c4c4d46db4c8a0125eb2254d073c882c6b765a1d2c713e69bbe6b6c94cd86" already present on machine
kube-system 2m44s Normal Created pod/gke-metrics-agent-5vh72 Created container: core-metrics-exporter
... skipping 104 lines ...
kube-system 2m20s Normal Created pod/kube-dns-7d885bc45b-bzr4t Created container: prometheus-to-sd
kube-system 2m20s Normal Started pod/kube-dns-7d885bc45b-bzr4t Started container prometheus-to-sd
kube-system 2m20s Normal Pulling pod/kube-dns-7d885bc45b-bzr4t Pulling image "us-central1-artifactregistry.gcr.io/gke-release/gke-release/gke-metrics-collector:20250209_2300_RC0@sha256:9678041ad0020efc360d4a9c0c616b48cc1224599545a103be3b2b853c521914"
kube-system 2m19s Normal Pulled pod/kube-dns-7d885bc45b-bzr4t Successfully pulled image "us-central1-artifactregistry.gcr.io/gke-release/gke-release/gke-metrics-collector:20250209_2300_RC0@sha256:9678041ad0020efc360d4a9c0c616b48cc1224599545a103be3b2b853c521914" in 1.174s (1.174s including waiting). Image size: 25588923 bytes.
kube-system 2m19s Normal Created pod/kube-dns-7d885bc45b-bzr4t Created container: kubedns-metrics-collector
kube-system 2m19s Normal Started pod/kube-dns-7d885bc45b-bzr4t Started container kubedns-metrics-collector
kube-system 4m8s Warning FailedCreate replicaset/kube-dns-7d885bc45b Error creating: insufficient quota to match these scopes: [{PriorityClass In [system-node-critical system-cluster-critical]}]
kube-system 4m8s Normal SuccessfulCreate replicaset/kube-dns-7d885bc45b Created pod: kube-dns-7d885bc45b-bzr4t
kube-system 2m28s Normal SuccessfulCreate replicaset/kube-dns-7d885bc45b Created pod: kube-dns-7d885bc45b-2zp2z
kube-system 3m37s Warning FailedScheduling pod/kube-dns-autoscaler-8b7698c76-jc68r no nodes available to schedule pods
kube-system 3m33s Warning FailedScheduling pod/kube-dns-autoscaler-8b7698c76-jc68r no nodes available to schedule pods
kube-system 2m30s Normal Scheduled pod/kube-dns-autoscaler-8b7698c76-jc68r Successfully assigned kube-system/kube-dns-autoscaler-8b7698c76-jc68r to gke-ttriggers-e2e-cls190-default-pool-4e8c6bda-g0t6
kube-system 2m31s Normal Pulling pod/kube-dns-autoscaler-8b7698c76-jc68r Pulling image "us-central1-artifactregistry.gcr.io/gke-release/gke-release/cluster-proportional-autoscaler:v1.8.11-gke.22@sha256:5edd2b6dade7b1dbe25bc652ad5fbdf46c6155433729c48e738b970ec9ffdd8f"
... skipping 29 lines ...
kube-system 2m30s Normal Scheduled pod/metrics-server-v1.31.0-65c95fbd4d-dzxz8 Successfully assigned kube-system/metrics-server-v1.31.0-65c95fbd4d-dzxz8 to gke-ttriggers-e2e-cls190-default-pool-4e8c6bda-g0t6
kube-system 2m30s Normal Pulling pod/metrics-server-v1.31.0-65c95fbd4d-dzxz8 Pulling image "us-central1-artifactregistry.gcr.io/gke-release/gke-release/metrics-server:v0.7.1-gke.32@sha256:cb17249a88fbbaeff5701654f5625a01d1faa0797faa6d463c121dde3fcc122f"
kube-system 2m26s Normal Pulled pod/metrics-server-v1.31.0-65c95fbd4d-dzxz8 Successfully pulled image "us-central1-artifactregistry.gcr.io/gke-release/gke-release/metrics-server:v0.7.1-gke.32@sha256:cb17249a88fbbaeff5701654f5625a01d1faa0797faa6d463c121dde3fcc122f" in 2.004s (4.359s including waiting). Image size: 19267350 bytes.
kube-system 2m26s Normal Created pod/metrics-server-v1.31.0-65c95fbd4d-dzxz8 Created container: metrics-server
kube-system 2m26s Normal Started pod/metrics-server-v1.31.0-65c95fbd4d-dzxz8 Started container metrics-server
kube-system 90s Normal Killing pod/metrics-server-v1.31.0-65c95fbd4d-dzxz8 Stopping container metrics-server
kube-system 3m22s Warning FailedCreate replicaset/metrics-server-v1.31.0-65c95fbd4d Error creating: pods "metrics-server-v1.31.0-65c95fbd4d-" is forbidden: error looking up service account kube-system/metrics-server: serviceaccount "metrics-server" not found
kube-system 3m21s Normal SuccessfulCreate replicaset/metrics-server-v1.31.0-65c95fbd4d Created pod: metrics-server-v1.31.0-65c95fbd4d-dzxz8
kube-system 90s Normal SuccessfulDelete replicaset/metrics-server-v1.31.0-65c95fbd4d Deleted pod: metrics-server-v1.31.0-65c95fbd4d-dzxz8
kube-system 3m19s Warning FailedScheduling pod/metrics-server-v1.31.0-769c5b4896-8svrm no nodes available to schedule pods
kube-system 3m15s Warning FailedScheduling pod/metrics-server-v1.31.0-769c5b4896-8svrm no nodes available to schedule pods
kube-system 2m30s Normal Scheduled pod/metrics-server-v1.31.0-769c5b4896-8svrm Successfully assigned kube-system/metrics-server-v1.31.0-769c5b4896-8svrm to gke-ttriggers-e2e-cls190-default-pool-4e8c6bda-g0t6
kube-system 2m29s Normal Pulling pod/metrics-server-v1.31.0-769c5b4896-8svrm Pulling image "us-central1-artifactregistry.gcr.io/gke-release/gke-release/metrics-server:v0.7.1-gke.32@sha256:cb17249a88fbbaeff5701654f5625a01d1faa0797faa6d463c121dde3fcc122f"
... skipping 65 lines ...
tekton-pipelines 109s Normal Created pod/tekton-pipelines-webhook-6d44946d47-zf6mk Created container: webhook
tekton-pipelines 109s Normal Started pod/tekton-pipelines-webhook-6d44946d47-zf6mk Started container webhook
tekton-pipelines 112s Normal SuccessfulCreate replicaset/tekton-pipelines-webhook-6d44946d47 Created pod: tekton-pipelines-webhook-6d44946d47-zf6mk
tekton-pipelines 113s Normal ScalingReplicaSet deployment/tekton-pipelines-webhook Scaled up replica set tekton-pipelines-webhook-6d44946d47 to 1
tekton-pipelines 68s Warning FailedGetResourceMetric horizontalpodautoscaler/tekton-pipelines-webhook No recommendation
***************************************
*** E2E TEST FAILED ***
*** End of information dump ***
***************************************
2025/03/28 15:33:30 process.go:155: Step '/home/prow/go/src/github.com/tektoncd/triggers/test/e2e-tests.sh --run-tests' finished in 2m8.791796875s
2025/03/28 15:33:30 main.go:319: Something went wrong: encountered 1 errors: [error during /home/prow/go/src/github.com/tektoncd/triggers/test/e2e-tests.sh --run-tests: exit status 1]
Test subprocess exited with code 0
Artifacts were written to /logs/artifacts
Test result code is 1
==================================
==== INTEGRATION TESTS FAILED ====
==================================
+ EXIT_VALUE=1
+ set +o xtrace