Error lines from build-log.txt
... skipping 345 lines ...
configmap/config-leader-election-triggers-controller created
configmap/config-leader-election-triggers-webhook created
configmap/config-logging-triggers created
configmap/config-observability-triggers created
service/tekton-triggers-controller created
service/tekton-triggers-webhook created
Error: error processing import paths in "config/webhook.yaml": error resolving image references: GET https://gcr.io/v2/token?scope=repository%3Atekton-prow-0%2Fttriggers-e2e-img%2Fwebhook-dd1edc925ee1772a9f76e2c1bc291ef6%3Apush%2Cpull&scope=repository%3Adistroless%2Fstatic%3Apull&service=gcr.io: unexpected status code 412 Precondition Failed: Container Registry is deprecated and shutting down, please use the auto migration tool to migrate to Artifact Registry (gcloud artifacts docker upgrade migrate --projects='tekton-prow-0'). For more details see: https://cloud.google.com/artifact-registry/docs/transition/auto-migrate-gcr-ar
ERROR: Tekton Triggers installation failed
***************************************
*** E2E TEST FAILED ***
*** Start of information dump ***
***************************************
>>> All resources:
NAMESPACE NAME READY STATUS RESTARTS AGE
gke-managed-cim pod/kube-state-metrics-0 2/2 Running 0 4m58s
gmp-system pod/collector-6ckbl 2/2 Running 0 3m52s
... skipping 167 lines ...
gke-managed-cim 3m28s Normal Created pod/kube-state-metrics-0 Created container: kube-state-metrics
gke-managed-cim 3m27s Normal Started pod/kube-state-metrics-0 Started container kube-state-metrics
gke-managed-cim 3m27s Normal Pulling pod/kube-state-metrics-0 Pulling image "us-central1-artifactregistry.gcr.io/gke-release/gke-release/gke-metrics-collector:20240501_2300_RC0@sha256:af727fbef6a16960bd3541d89b94e1a4938b57041e5869f148995d8c271a6334"
gke-managed-cim 3m25s Normal Pulled pod/kube-state-metrics-0 Successfully pulled image "us-central1-artifactregistry.gcr.io/gke-release/gke-release/gke-metrics-collector:20240501_2300_RC0@sha256:af727fbef6a16960bd3541d89b94e1a4938b57041e5869f148995d8c271a6334" in 1.264s (2.58s including waiting). Image size: 23786769 bytes.
gke-managed-cim 3m25s Normal Created pod/kube-state-metrics-0 Created container: ksm-metrics-collector
gke-managed-cim 3m25s Normal Started pod/kube-state-metrics-0 Started container ksm-metrics-collector
gke-managed-cim 4m59s Warning FailedCreate statefulset/kube-state-metrics create Pod kube-state-metrics-0 in StatefulSet kube-state-metrics failed error: pods "kube-state-metrics-0" is forbidden: error looking up service account gke-managed-cim/kube-state-metrics: serviceaccount "kube-state-metrics" not found
gke-managed-cim 4m59s Normal SuccessfulCreate statefulset/kube-state-metrics create Pod kube-state-metrics-0 in StatefulSet kube-state-metrics successful
gke-managed-cim 2m28s Warning FailedGetResourceMetric horizontalpodautoscaler/kube-state-metrics unable to get metric memory: unable to fetch metrics from resource metrics API: the server is currently unable to handle the request (get pods.metrics.k8s.io)
gke-managed-volumepopulator 4m40s Normal LeaderElection lease/gke-volume-populator-leader gke-303cc39e4cef463fb61f-0796-1014-vm became leader
gmp-system 4m24s Warning FailedScheduling pod/alertmanager-0 no nodes available to schedule pods
gmp-system 4m21s Warning FailedScheduling pod/alertmanager-0 no nodes available to schedule pods
gmp-system 3m32s Normal Scheduled pod/alertmanager-0 Successfully assigned gmp-system/alertmanager-0 to gke-ttriggers-e2e-cls190-default-pool-dd0a70fa-x83p
gmp-system 3m28s Warning FailedMount pod/alertmanager-0 MountVolume.SetUp failed for volume "config" : secret "alertmanager" not found
gmp-system 4m25s Normal SuccessfulCreate statefulset/alertmanager create Pod alertmanager-0 in StatefulSet alertmanager successful
gmp-system 3m25s Normal SuccessfulDelete statefulset/alertmanager delete Pod alertmanager-0 in StatefulSet alertmanager successful
gmp-system 3m52s Normal Scheduled pod/collector-6ckbl Successfully assigned gmp-system/collector-6ckbl to gke-ttriggers-e2e-cls190-default-pool-dd0a70fa-x83p
gmp-system 3m43s Warning NetworkNotReady pod/collector-6ckbl network is not ready: container runtime network not ready: NetworkReady=false reason:NetworkPluginNotReady message:Network plugin returns error: cni plugin not initialized
gmp-system 3m45s Warning FailedMount pod/collector-6ckbl MountVolume.SetUp failed for volume "config" : object "gmp-system"/"collector" not registered
gmp-system 3m45s Warning FailedMount pod/collector-6ckbl MountVolume.SetUp failed for volume "collection-secret" : object "gmp-system"/"collection" not registered
gmp-system 3m44s Warning FailedMount pod/collector-6ckbl MountVolume.SetUp failed for volume "kube-api-access-rrrjc" : object "gmp-system"/"kube-root-ca.crt" not registered
gmp-system 3m37s Warning FailedMount pod/collector-6ckbl MountVolume.SetUp failed for volume "config" : configmap "collector" not found
gmp-system 3m37s Warning FailedMount pod/collector-6ckbl MountVolume.SetUp failed for volume "collection-secret" : secret "collection" not found
gmp-system 3m20s Normal Pulling pod/collector-6ckbl Pulling image "us-central1-artifactregistry.gcr.io/gke-release/gke-release/gke-distroless/bash:gke_distroless_20240907.00_p0@sha256:ff5d5abcc0cdd74d3ba43b0959b246c4432c14356b1414ce35d8feff820eb664"
gmp-system 3m19s Normal Pulled pod/collector-6ckbl Successfully pulled image "us-central1-artifactregistry.gcr.io/gke-release/gke-release/gke-distroless/bash:gke_distroless_20240907.00_p0@sha256:ff5d5abcc0cdd74d3ba43b0959b246c4432c14356b1414ce35d8feff820eb664" in 633ms (633ms including waiting). Image size: 18373482 bytes.
gmp-system 3m51s Normal Scheduled pod/collector-c4ssz Successfully assigned gmp-system/collector-c4ssz to gke-ttriggers-e2e-cls190-default-pool-fa142840-d6mr
gmp-system 3m40s Warning NetworkNotReady pod/collector-c4ssz network is not ready: container runtime network not ready: NetworkReady=false reason:NetworkPluginNotReady message:Network plugin returns error: cni plugin not initialized
gmp-system 3m44s Warning FailedMount pod/collector-c4ssz MountVolume.SetUp failed for volume "config" : object "gmp-system"/"collector" not registered
gmp-system 3m44s Warning FailedMount pod/collector-c4ssz MountVolume.SetUp failed for volume "collection-secret" : object "gmp-system"/"collection" not registered
gmp-system 3m44s Warning FailedMount pod/collector-c4ssz MountVolume.SetUp failed for volume "kube-api-access-dnbv2" : object "gmp-system"/"kube-root-ca.crt" not registered
gmp-system 3m36s Warning FailedMount pod/collector-c4ssz MountVolume.SetUp failed for volume "config" : configmap "collector" not found
gmp-system 3m36s Warning FailedMount pod/collector-c4ssz MountVolume.SetUp failed for volume "collection-secret" : secret "collection" not found
gmp-system 3m19s Normal Pulling pod/collector-c4ssz Pulling image "us-central1-artifactregistry.gcr.io/gke-release/gke-release/gke-distroless/bash:gke_distroless_20240907.00_p0@sha256:ff5d5abcc0cdd74d3ba43b0959b246c4432c14356b1414ce35d8feff820eb664"
gmp-system 3m42s Warning NetworkNotReady pod/collector-gm9qx network is not ready: container runtime network not ready: NetworkReady=false reason:NetworkPluginNotReady message:Network plugin returns error: cni plugin not initialized
gmp-system 3m51s Normal Scheduled pod/collector-gm9qx Successfully assigned gmp-system/collector-gm9qx to gke-ttriggers-e2e-cls190-default-pool-d294cc21-f7rc
gmp-system 3m44s Warning FailedMount pod/collector-gm9qx MountVolume.SetUp failed for volume "collection-secret" : object "gmp-system"/"collection" not registered
gmp-system 3m44s Warning FailedMount pod/collector-gm9qx MountVolume.SetUp failed for volume "config" : object "gmp-system"/"collector" not registered
gmp-system 3m44s Warning FailedMount pod/collector-gm9qx MountVolume.SetUp failed for volume "kube-api-access-2bkff" : object "gmp-system"/"kube-root-ca.crt" not registered
gmp-system 3m36s Warning FailedMount pod/collector-gm9qx MountVolume.SetUp failed for volume "config" : configmap "collector" not found
gmp-system 3m36s Warning FailedMount pod/collector-gm9qx MountVolume.SetUp failed for volume "collection-secret" : secret "collection" not found
gmp-system 3m20s Normal Pulling pod/collector-gm9qx Pulling image "us-central1-artifactregistry.gcr.io/gke-release/gke-release/gke-distroless/bash:gke_distroless_20240907.00_p0@sha256:ff5d5abcc0cdd74d3ba43b0959b246c4432c14356b1414ce35d8feff820eb664"
gmp-system 3m19s Normal Pulled pod/collector-gm9qx Successfully pulled image "us-central1-artifactregistry.gcr.io/gke-release/gke-release/gke-distroless/bash:gke_distroless_20240907.00_p0@sha256:ff5d5abcc0cdd74d3ba43b0959b246c4432c14356b1414ce35d8feff820eb664" in 1.162s (1.162s including waiting). Image size: 18373482 bytes.
gmp-system 3m53s Normal SuccessfulCreate daemonset/collector Created pod: collector-6ckbl
gmp-system 3m52s Normal SuccessfulCreate daemonset/collector Created pod: collector-gm9qx
gmp-system 3m52s Normal SuccessfulCreate daemonset/collector Created pod: collector-c4ssz
gmp-system 4m25s Warning FailedScheduling pod/gmp-operator-7cbb6468c5-4vdmw no nodes available to schedule pods
... skipping 5 lines ...
gmp-system 3m26s Normal Started pod/gmp-operator-7cbb6468c5-4vdmw Started container operator
gmp-system 4m25s Normal SuccessfulCreate replicaset/gmp-operator-7cbb6468c5 Created pod: gmp-operator-7cbb6468c5-4vdmw
gmp-system 4m25s Normal ScalingReplicaSet deployment/gmp-operator Scaled up replica set gmp-operator-7cbb6468c5 to 1
gmp-system 4m24s Warning FailedScheduling pod/rule-evaluator-858df77cc7-z98r2 no nodes available to schedule pods
gmp-system 4m21s Warning FailedScheduling pod/rule-evaluator-858df77cc7-z98r2 no nodes available to schedule pods
gmp-system 3m32s Normal Scheduled pod/rule-evaluator-858df77cc7-z98r2 Successfully assigned gmp-system/rule-evaluator-858df77cc7-z98r2 to gke-ttriggers-e2e-cls190-default-pool-dd0a70fa-x83p
gmp-system 3m28s Warning FailedMount pod/rule-evaluator-858df77cc7-z98r2 MountVolume.SetUp failed for volume "config" : configmap "rule-evaluator" not found
gmp-system 3m28s Warning FailedMount pod/rule-evaluator-858df77cc7-z98r2 MountVolume.SetUp failed for volume "rules" : configmap "rules-generated" not found
gmp-system 3m24s Warning FailedMount pod/rule-evaluator-858df77cc7-z98r2 MountVolume.SetUp failed for volume "rules-secret" : secret "rules" not found
gmp-system 4m25s Normal SuccessfulCreate replicaset/rule-evaluator-858df77cc7 Created pod: rule-evaluator-858df77cc7-z98r2
gmp-system 3m25s Normal SuccessfulDelete replicaset/rule-evaluator-858df77cc7 Deleted pod: rule-evaluator-858df77cc7-z98r2
gmp-system 4m25s Normal ScalingReplicaSet deployment/rule-evaluator Scaled up replica set rule-evaluator-858df77cc7 to 1
gmp-system 3m25s Normal ScalingReplicaSet deployment/rule-evaluator Scaled down replica set rule-evaluator-858df77cc7 to 0 from 1
kube-system 5m12s Normal LeaderElection lease/addon-manager gke-303cc39e4cef463fb61f-864f-96ef-vm_da47e506-e873-4829-a146-08276e42addf became leader
kube-system 4m19s Normal LeaderElection lease/addon-resizer gke-303cc39e4cef463fb61f-864f-96ef-vm became leader
... skipping 98 lines ...
kube-system 3m49s Normal Started pod/gke-metrics-agent-5k56p Started container core-metrics-exporter
kube-system 3m49s Normal Pulling pod/gke-metrics-agent-5k56p Pulling image "us-central1-artifactregistry.gcr.io/gke-release/gke-release/gke-metrics-collector:20240902_2300_RC0@sha256:52df59dabb65d3d315ee03768ca1e9d84da2821a799c54cab7539f5f5b19849e"
kube-system 3m47s Normal Pulled pod/gke-metrics-agent-5k56p Successfully pulled image "us-central1-artifactregistry.gcr.io/gke-release/gke-release/gke-metrics-collector:20240902_2300_RC0@sha256:52df59dabb65d3d315ee03768ca1e9d84da2821a799c54cab7539f5f5b19849e" in 1.567s (1.567s including waiting). Image size: 24781314 bytes.
kube-system 3m47s Normal Created pod/gke-metrics-agent-5k56p Created container: prometheus-metrics-collector
kube-system 3m47s Normal Started pod/gke-metrics-agent-5k56p Started container prometheus-metrics-collector
kube-system 3m50s Normal Scheduled pod/gke-metrics-agent-xr7kn Successfully assigned kube-system/gke-metrics-agent-xr7kn to gke-ttriggers-e2e-cls190-default-pool-fa142840-d6mr
kube-system 3m50s Warning FailedMount pod/gke-metrics-agent-xr7kn MountVolume.SetUp failed for volume "prometheus-metrics-collector-config-map-vol" : failed to sync configmap cache: timed out waiting for the condition
kube-system 3m50s Warning FailedMount pod/gke-metrics-agent-xr7kn MountVolume.SetUp failed for volume "gke-metrics-agent-config-vol" : failed to sync configmap cache: timed out waiting for the condition
kube-system 3m49s Normal Pulling pod/gke-metrics-agent-xr7kn Pulling image "us-central1-artifactregistry.gcr.io/gke-release/gke-release/gke-metrics-agent:1.13.0-gke.2@sha256:919c4c4d46db4c8a0125eb2254d073c882c6b765a1d2c713e69bbe6b6c94cd86"
kube-system 3m46s Normal Pulled pod/gke-metrics-agent-xr7kn Successfully pulled image "us-central1-artifactregistry.gcr.io/gke-release/gke-release/gke-metrics-agent:1.13.0-gke.2@sha256:919c4c4d46db4c8a0125eb2254d073c882c6b765a1d2c713e69bbe6b6c94cd86" in 2.79s (2.79s including waiting). Image size: 27456613 bytes.
kube-system 3m46s Normal Created pod/gke-metrics-agent-xr7kn Created container: gke-metrics-agent
kube-system 3m46s Normal Started pod/gke-metrics-agent-xr7kn Started container gke-metrics-agent
kube-system 3m46s Normal Pulled pod/gke-metrics-agent-xr7kn Container image "us-central1-artifactregistry.gcr.io/gke-release/gke-release/gke-metrics-agent:1.13.0-gke.2@sha256:919c4c4d46db4c8a0125eb2254d073c882c6b765a1d2c713e69bbe6b6c94cd86" already present on machine
kube-system 3m46s Normal Created pod/gke-metrics-agent-xr7kn Created container: core-metrics-exporter
... skipping 133 lines ...
kube-system 3m32s Normal Scheduled pod/metrics-server-v1.31.0-65c95fbd4d-2xpc6 Successfully assigned kube-system/metrics-server-v1.31.0-65c95fbd4d-2xpc6 to gke-ttriggers-e2e-cls190-default-pool-dd0a70fa-x83p
kube-system 3m32s Normal Pulling pod/metrics-server-v1.31.0-65c95fbd4d-2xpc6 Pulling image "us-central1-artifactregistry.gcr.io/gke-release/gke-release/metrics-server:v0.7.1-gke.32@sha256:cb17249a88fbbaeff5701654f5625a01d1faa0797faa6d463c121dde3fcc122f"
kube-system 3m30s Normal Pulled pod/metrics-server-v1.31.0-65c95fbd4d-2xpc6 Successfully pulled image "us-central1-artifactregistry.gcr.io/gke-release/gke-release/metrics-server:v0.7.1-gke.32@sha256:cb17249a88fbbaeff5701654f5625a01d1faa0797faa6d463c121dde3fcc122f" in 1.696s (1.696s including waiting). Image size: 19267350 bytes.
kube-system 3m30s Normal Created pod/metrics-server-v1.31.0-65c95fbd4d-2xpc6 Created container: metrics-server
kube-system 3m30s Normal Started pod/metrics-server-v1.31.0-65c95fbd4d-2xpc6 Started container metrics-server
kube-system 2m31s Normal Killing pod/metrics-server-v1.31.0-65c95fbd4d-2xpc6 Stopping container metrics-server
kube-system 4m19s Warning FailedCreate replicaset/metrics-server-v1.31.0-65c95fbd4d Error creating: pods "metrics-server-v1.31.0-65c95fbd4d-" is forbidden: error looking up service account kube-system/metrics-server: serviceaccount "metrics-server" not found
kube-system 4m18s Normal SuccessfulCreate replicaset/metrics-server-v1.31.0-65c95fbd4d Created pod: metrics-server-v1.31.0-65c95fbd4d-2xpc6
kube-system 2m31s Normal SuccessfulDelete replicaset/metrics-server-v1.31.0-65c95fbd4d Deleted pod: metrics-server-v1.31.0-65c95fbd4d-2xpc6
kube-system 4m18s Warning FailedScheduling pod/metrics-server-v1.31.0-769c5b4896-486bf no nodes available to schedule pods
kube-system 4m14s Warning FailedScheduling pod/metrics-server-v1.31.0-769c5b4896-486bf no nodes available to schedule pods
kube-system 3m32s Normal Scheduled pod/metrics-server-v1.31.0-769c5b4896-486bf Successfully assigned kube-system/metrics-server-v1.31.0-769c5b4896-486bf to gke-ttriggers-e2e-cls190-default-pool-dd0a70fa-x83p
kube-system 3m30s Normal Pulling pod/metrics-server-v1.31.0-769c5b4896-486bf Pulling image "us-central1-artifactregistry.gcr.io/gke-release/gke-release/metrics-server:v0.7.1-gke.32@sha256:cb17249a88fbbaeff5701654f5625a01d1faa0797faa6d463c121dde3fcc122f"
... skipping 65 lines ...
tekton-pipelines 2m40s Normal Created pod/tekton-pipelines-webhook-6d44946d47-qbzrc Created container: webhook
tekton-pipelines 2m40s Normal Started pod/tekton-pipelines-webhook-6d44946d47-qbzrc Started container webhook
tekton-pipelines 2m44s Normal SuccessfulCreate replicaset/tekton-pipelines-webhook-6d44946d47 Created pod: tekton-pipelines-webhook-6d44946d47-qbzrc
tekton-pipelines 2m44s Normal ScalingReplicaSet deployment/tekton-pipelines-webhook Scaled up replica set tekton-pipelines-webhook-6d44946d47 to 1
tekton-pipelines 103s Warning FailedGetResourceMetric horizontalpodautoscaler/tekton-pipelines-webhook No recommendation
***************************************
*** E2E TEST FAILED ***
*** End of information dump ***
***************************************
2025/03/31 10:43:30 process.go:155: Step '/home/prow/go/src/github.com/tektoncd/triggers/test/e2e-tests.sh --run-tests' finished in 3m6.421490381s
2025/03/31 10:43:30 main.go:319: Something went wrong: encountered 1 errors: [error during /home/prow/go/src/github.com/tektoncd/triggers/test/e2e-tests.sh --run-tests: exit status 1]
Test subprocess exited with code 0
Artifacts were written to /logs/artifacts
Test result code is 1
==================================
==== INTEGRATION TESTS FAILED ====
==================================
+ EXIT_VALUE=1
+ set +o xtrace