Error lines from build-log.txt
... skipping 2513 lines ...
configmap/config-leader-election-triggers-controller created
configmap/config-leader-election-triggers-webhook created
configmap/config-logging-triggers created
configmap/config-observability-triggers created
service/tekton-triggers-controller created
service/tekton-triggers-webhook created
Error: error processing import paths in "config/webhook.yaml": error resolving image references: GET https://gcr.io/v2/token?scope=repository%3Atekton-prow-5%2Fttriggers-e2e-img%2Fwebhook-dd1edc925ee1772a9f76e2c1bc291ef6%3Apush%2Cpull&scope=repository%3Adistroless%2Fstatic%3Apull&service=gcr.io: unexpected status code 412 Precondition Failed: Container Registry is deprecated and shutting down, please use the auto migration tool to migrate to Artifact Registry (gcloud artifacts docker upgrade migrate --projects='tekton-prow-5'). For more details see: https://cloud.google.com/artifact-registry/docs/transition/auto-migrate-gcr-ar
ERROR: Tekton Triggers installation failed
***************************************
*** E2E TEST FAILED ***
*** Start of information dump ***
***************************************
>>> All resources:
NAMESPACE NAME READY STATUS RESTARTS AGE
gke-managed-cim pod/kube-state-metrics-0 2/2 Running 0 4m7s
gmp-system pod/collector-2x4rr 2/2 Running 0 2m58s
... skipping 171 lines ...
gke-managed-cim 2m39s Normal Created pod/kube-state-metrics-0 Created container: kube-state-metrics
gke-managed-cim 2m39s Normal Started pod/kube-state-metrics-0 Started container kube-state-metrics
gke-managed-cim 2m39s Normal Pulling pod/kube-state-metrics-0 Pulling image "us-central1-artifactregistry.gcr.io/gke-release/gke-release/gke-metrics-collector:20240501_2300_RC0@sha256:af727fbef6a16960bd3541d89b94e1a4938b57041e5869f148995d8c271a6334"
gke-managed-cim 2m35s Normal Pulled pod/kube-state-metrics-0 Successfully pulled image "us-central1-artifactregistry.gcr.io/gke-release/gke-release/gke-metrics-collector:20240501_2300_RC0@sha256:af727fbef6a16960bd3541d89b94e1a4938b57041e5869f148995d8c271a6334" in 1.494s (4.163s including waiting). Image size: 23786769 bytes.
gke-managed-cim 2m35s Normal Created pod/kube-state-metrics-0 Created container: ksm-metrics-collector
gke-managed-cim 2m34s Normal Started pod/kube-state-metrics-0 Started container ksm-metrics-collector
gke-managed-cim 4m8s Warning FailedCreate statefulset/kube-state-metrics create Pod kube-state-metrics-0 in StatefulSet kube-state-metrics failed error: pods "kube-state-metrics-0" is forbidden: error looking up service account gke-managed-cim/kube-state-metrics: serviceaccount "kube-state-metrics" not found
gke-managed-cim 4m8s Normal SuccessfulCreate statefulset/kube-state-metrics create Pod kube-state-metrics-0 in StatefulSet kube-state-metrics successful
gke-managed-cim 113s Warning FailedGetResourceMetric horizontalpodautoscaler/kube-state-metrics unable to get metric memory: unable to fetch metrics from resource metrics API: the server is currently unable to handle the request (get pods.metrics.k8s.io)
gke-managed-volumepopulator 3m48s Normal LeaderElection lease/gke-volume-populator-leader gke-38fbe5c2a0cb4567af52-6fbd-e26e-vm became leader
gmp-system 3m34s Warning FailedScheduling pod/alertmanager-0 no nodes available to schedule pods
gmp-system 3m30s Warning FailedScheduling pod/alertmanager-0 no nodes available to schedule pods
gmp-system 2m41s Normal Scheduled pod/alertmanager-0 Successfully assigned gmp-system/alertmanager-0 to gke-ttriggers-e2e-cls190-default-pool-1020d8d4-xj8m
gmp-system 2m38s Warning FailedMount pod/alertmanager-0 MountVolume.SetUp failed for volume "config" : secret "alertmanager" not found
gmp-system 3m34s Normal SuccessfulCreate statefulset/alertmanager create Pod alertmanager-0 in StatefulSet alertmanager successful
gmp-system 2m35s Normal SuccessfulDelete statefulset/alertmanager delete Pod alertmanager-0 in StatefulSet alertmanager successful
gmp-system 2m49s Warning NetworkNotReady pod/collector-2x4rr network is not ready: container runtime network not ready: NetworkReady=false reason:NetworkPluginNotReady message:Network plugin returns error: cni plugin not initialized
gmp-system 2m59s Normal Scheduled pod/collector-2x4rr Successfully assigned gmp-system/collector-2x4rr to gke-ttriggers-e2e-cls190-default-pool-8be4ae7c-j77w
gmp-system 2m51s Warning FailedMount pod/collector-2x4rr MountVolume.SetUp failed for volume "config" : object "gmp-system"/"collector" not registered
gmp-system 2m51s Warning FailedMount pod/collector-2x4rr MountVolume.SetUp failed for volume "collection-secret" : object "gmp-system"/"collection" not registered
gmp-system 2m51s Warning FailedMount pod/collector-2x4rr MountVolume.SetUp failed for volume "kube-api-access-d5nm6" : object "gmp-system"/"kube-root-ca.crt" not registered
gmp-system 2m43s Warning FailedMount pod/collector-2x4rr MountVolume.SetUp failed for volume "config" : configmap "collector" not found
gmp-system 2m43s Warning FailedMount pod/collector-2x4rr MountVolume.SetUp failed for volume "collection-secret" : secret "collection" not found
gmp-system 2m27s Normal Pulling pod/collector-2x4rr Pulling image "us-central1-artifactregistry.gcr.io/gke-release/gke-release/gke-distroless/bash:gke_distroless_20240907.00_p0@sha256:ff5d5abcc0cdd74d3ba43b0959b246c4432c14356b1414ce35d8feff820eb664"
gmp-system 2m26s Normal Pulled pod/collector-2x4rr Successfully pulled image "us-central1-artifactregistry.gcr.io/gke-release/gke-release/gke-distroless/bash:gke_distroless_20240907.00_p0@sha256:ff5d5abcc0cdd74d3ba43b0959b246c4432c14356b1414ce35d8feff820eb664" in 833ms (833ms including waiting). Image size: 18373482 bytes.
gmp-system 2m59s Normal Scheduled pod/collector-8gg7c Successfully assigned gmp-system/collector-8gg7c to gke-ttriggers-e2e-cls190-default-pool-dcb11f9d-f7rq
gmp-system 2m49s Warning NetworkNotReady pod/collector-8gg7c network is not ready: container runtime network not ready: NetworkReady=false reason:NetworkPluginNotReady message:Network plugin returns error: cni plugin not initialized
gmp-system 2m52s Warning FailedMount pod/collector-8gg7c MountVolume.SetUp failed for volume "collection-secret" : object "gmp-system"/"collection" not registered
gmp-system 2m52s Warning FailedMount pod/collector-8gg7c MountVolume.SetUp failed for volume "config" : object "gmp-system"/"collector" not registered
gmp-system 2m51s Warning FailedMount pod/collector-8gg7c MountVolume.SetUp failed for volume "kube-api-access-5hfzb" : object "gmp-system"/"kube-root-ca.crt" not registered
gmp-system 2m43s Warning FailedMount pod/collector-8gg7c MountVolume.SetUp failed for volume "config" : configmap "collector" not found
gmp-system 2m43s Warning FailedMount pod/collector-8gg7c MountVolume.SetUp failed for volume "collection-secret" : secret "collection" not found
gmp-system 2m27s Normal Pulling pod/collector-8gg7c Pulling image "us-central1-artifactregistry.gcr.io/gke-release/gke-release/gke-distroless/bash:gke_distroless_20240907.00_p0@sha256:ff5d5abcc0cdd74d3ba43b0959b246c4432c14356b1414ce35d8feff820eb664"
gmp-system 2m26s Normal Pulled pod/collector-8gg7c Successfully pulled image "us-central1-artifactregistry.gcr.io/gke-release/gke-release/gke-distroless/bash:gke_distroless_20240907.00_p0@sha256:ff5d5abcc0cdd74d3ba43b0959b246c4432c14356b1414ce35d8feff820eb664" in 935ms (935ms including waiting). Image size: 18373482 bytes.
gmp-system 3m1s Normal Scheduled pod/collector-bnrw5 Successfully assigned gmp-system/collector-bnrw5 to gke-ttriggers-e2e-cls190-default-pool-1020d8d4-xj8m
gmp-system 2m53s Warning NetworkNotReady pod/collector-bnrw5 network is not ready: container runtime network not ready: NetworkReady=false reason:NetworkPluginNotReady message:Network plugin returns error: cni plugin not initialized
gmp-system 2m53s Warning FailedMount pod/collector-bnrw5 MountVolume.SetUp failed for volume "config" : object "gmp-system"/"collector" not registered
gmp-system 2m53s Warning FailedMount pod/collector-bnrw5 MountVolume.SetUp failed for volume "collection-secret" : object "gmp-system"/"collection" not registered
gmp-system 2m53s Warning FailedMount pod/collector-bnrw5 MountVolume.SetUp failed for volume "kube-api-access-26r8s" : object "gmp-system"/"kube-root-ca.crt" not registered
gmp-system 2m45s Warning FailedMount pod/collector-bnrw5 MountVolume.SetUp failed for volume "config" : configmap "collector" not found
gmp-system 2m45s Warning FailedMount pod/collector-bnrw5 MountVolume.SetUp failed for volume "collection-secret" : secret "collection" not found
gmp-system 2m29s Normal Pulling pod/collector-bnrw5 Pulling image "us-central1-artifactregistry.gcr.io/gke-release/gke-release/gke-distroless/bash:gke_distroless_20240907.00_p0@sha256:ff5d5abcc0cdd74d3ba43b0959b246c4432c14356b1414ce35d8feff820eb664"
gmp-system 2m28s Normal Pulled pod/collector-bnrw5 Successfully pulled image "us-central1-artifactregistry.gcr.io/gke-release/gke-release/gke-distroless/bash:gke_distroless_20240907.00_p0@sha256:ff5d5abcc0cdd74d3ba43b0959b246c4432c14356b1414ce35d8feff820eb664" in 620ms (620ms including waiting). Image size: 18373482 bytes.
gmp-system 2m28s Normal Created pod/collector-bnrw5 Created container: config-init
gmp-system 3m1s Normal SuccessfulCreate daemonset/collector Created pod: collector-bnrw5
gmp-system 2m59s Normal SuccessfulCreate daemonset/collector Created pod: collector-8gg7c
gmp-system 2m59s Normal SuccessfulCreate daemonset/collector Created pod: collector-2x4rr
... skipping 6 lines ...
gmp-system 2m36s Normal Started pod/gmp-operator-78676fbbbb-2np2j Started container operator
gmp-system 3m34s Normal SuccessfulCreate replicaset/gmp-operator-78676fbbbb Created pod: gmp-operator-78676fbbbb-2np2j
gmp-system 3m34s Normal ScalingReplicaSet deployment/gmp-operator Scaled up replica set gmp-operator-78676fbbbb to 1
gmp-system 3m34s Warning FailedScheduling pod/rule-evaluator-858df77cc7-krfj5 no nodes available to schedule pods
gmp-system 3m30s Warning FailedScheduling pod/rule-evaluator-858df77cc7-krfj5 no nodes available to schedule pods
gmp-system 2m41s Normal Scheduled pod/rule-evaluator-858df77cc7-krfj5 Successfully assigned gmp-system/rule-evaluator-858df77cc7-krfj5 to gke-ttriggers-e2e-cls190-default-pool-1020d8d4-xj8m
gmp-system 2m38s Warning FailedMount pod/rule-evaluator-858df77cc7-krfj5 MountVolume.SetUp failed for volume "config" : configmap "rule-evaluator" not found
gmp-system 2m38s Warning FailedMount pod/rule-evaluator-858df77cc7-krfj5 MountVolume.SetUp failed for volume "rules" : configmap "rules-generated" not found
gmp-system 2m38s Warning FailedMount pod/rule-evaluator-858df77cc7-krfj5 MountVolume.SetUp failed for volume "rules-secret" : secret "rules" not found
gmp-system 3m34s Normal SuccessfulCreate replicaset/rule-evaluator-858df77cc7 Created pod: rule-evaluator-858df77cc7-krfj5
gmp-system 2m34s Normal SuccessfulDelete replicaset/rule-evaluator-858df77cc7 Deleted pod: rule-evaluator-858df77cc7-krfj5
gmp-system 3m34s Normal ScalingReplicaSet deployment/rule-evaluator Scaled up replica set rule-evaluator-858df77cc7 to 1
gmp-system 2m34s Normal ScalingReplicaSet deployment/rule-evaluator Scaled down replica set rule-evaluator-858df77cc7 to 0 from 1
kube-system 4m17s Normal LeaderElection lease/addon-manager gke-38fbe5c2a0cb4567af52-b6f5-9850-vm_f163133e-f6db-4b65-8839-ce44bf730da2 became leader
kube-system 3m26s Normal LeaderElection lease/addon-resizer gke-38fbe5c2a0cb4567af52-6fbd-e26e-vm became leader
... skipping 242 lines ...
kube-system 2m41s Normal Scheduled pod/metrics-server-v1.31.0-65c95fbd4d-smtds Successfully assigned kube-system/metrics-server-v1.31.0-65c95fbd4d-smtds to gke-ttriggers-e2e-cls190-default-pool-1020d8d4-xj8m
kube-system 2m40s Normal Pulling pod/metrics-server-v1.31.0-65c95fbd4d-smtds Pulling image "us-central1-artifactregistry.gcr.io/gke-release/gke-release/metrics-server:v0.7.1-gke.32@sha256:cb17249a88fbbaeff5701654f5625a01d1faa0797faa6d463c121dde3fcc122f"
kube-system 2m36s Normal Pulled pod/metrics-server-v1.31.0-65c95fbd4d-smtds Successfully pulled image "us-central1-artifactregistry.gcr.io/gke-release/gke-release/metrics-server:v0.7.1-gke.32@sha256:cb17249a88fbbaeff5701654f5625a01d1faa0797faa6d463c121dde3fcc122f" in 1.278s (4.558s including waiting). Image size: 19267350 bytes.
kube-system 2m36s Normal Created pod/metrics-server-v1.31.0-65c95fbd4d-smtds Created container: metrics-server
kube-system 2m36s Normal Started pod/metrics-server-v1.31.0-65c95fbd4d-smtds Started container metrics-server
kube-system 101s Normal Killing pod/metrics-server-v1.31.0-65c95fbd4d-smtds Stopping container metrics-server
kube-system 101s Warning Unhealthy pod/metrics-server-v1.31.0-65c95fbd4d-smtds Readiness probe failed: Get "https://10.44.2.10:10250/readyz": dial tcp 10.44.2.10:10250: connect: connection refused
kube-system 3m28s Warning FailedCreate replicaset/metrics-server-v1.31.0-65c95fbd4d Error creating: pods "metrics-server-v1.31.0-65c95fbd4d-" is forbidden: error looking up service account kube-system/metrics-server: serviceaccount "metrics-server" not found
kube-system 3m27s Normal SuccessfulCreate replicaset/metrics-server-v1.31.0-65c95fbd4d Created pod: metrics-server-v1.31.0-65c95fbd4d-smtds
kube-system 101s Normal SuccessfulDelete replicaset/metrics-server-v1.31.0-65c95fbd4d Deleted pod: metrics-server-v1.31.0-65c95fbd4d-smtds
kube-system 3m26s Warning FailedScheduling pod/metrics-server-v1.31.0-769c5b4896-zsqhh no nodes available to schedule pods
kube-system 3m22s Warning FailedScheduling pod/metrics-server-v1.31.0-769c5b4896-zsqhh no nodes available to schedule pods
kube-system 2m41s Normal Scheduled pod/metrics-server-v1.31.0-769c5b4896-zsqhh Successfully assigned kube-system/metrics-server-v1.31.0-769c5b4896-zsqhh to gke-ttriggers-e2e-cls190-default-pool-1020d8d4-xj8m
kube-system 2m40s Normal Pulling pod/metrics-server-v1.31.0-769c5b4896-zsqhh Pulling image "us-central1-artifactregistry.gcr.io/gke-release/gke-release/metrics-server:v0.7.1-gke.32@sha256:cb17249a88fbbaeff5701654f5625a01d1faa0797faa6d463c121dde3fcc122f"
... skipping 65 lines ...
tekton-pipelines 2m1s Normal Created pod/tekton-pipelines-webhook-6d44946d47-tjm2l Created container: webhook
tekton-pipelines 2m1s Normal Started pod/tekton-pipelines-webhook-6d44946d47-tjm2l Started container webhook
tekton-pipelines 2m4s Normal SuccessfulCreate replicaset/tekton-pipelines-webhook-6d44946d47 Created pod: tekton-pipelines-webhook-6d44946d47-tjm2l
tekton-pipelines 2m4s Normal ScalingReplicaSet deployment/tekton-pipelines-webhook Scaled up replica set tekton-pipelines-webhook-6d44946d47 to 1
tekton-pipelines 49s Warning FailedGetResourceMetric horizontalpodautoscaler/tekton-pipelines-webhook No recommendation
***************************************
*** E2E TEST FAILED ***
*** End of information dump ***
***************************************
2025/03/31 11:12:04 process.go:155: Step '/home/prow/go/src/github.com/tektoncd/triggers/test/e2e-tests.sh --run-tests' finished in 2m20.765674834s
2025/03/31 11:12:04 main.go:319: Something went wrong: encountered 1 errors: [error during /home/prow/go/src/github.com/tektoncd/triggers/test/e2e-tests.sh --run-tests: exit status 1]
Test subprocess exited with code 0
Artifacts were written to /logs/artifacts
Test result code is 1
==================================
==== INTEGRATION TESTS FAILED ====
==================================
+ EXIT_VALUE=1
+ set +o xtrace